BDBM50268472 (R)-1-(1,4'-bipiperidin-1'-yl)-3-(7-methyl-1H-indazol-5-yl)-1-oxopropan-2-yl 4-(2-oxo-1,2-dihydroquinazolin-3(4H)-yl)piperidine-1-carboxylate::CHEMBL452966
SMILES: Cc1cc(C[C@@H](OC(=O)N2CCC(CC2)N2Cc3ccccc3NC2=O)C(=O)N2CCC(CC2)N2CCCCC2)cc2cn[nH]c12
InChI Key: InChIKey=DHQUHQOPJWMPBJ-WJOKGBTCSA-N
Data: 1 IC50
Activity Spreadsheet -- Enzyme Inhibition Constant Data from BindingDB
Found 1 hit for monomerid = 50268472
Trg + Lig
Ki
nM
ΔG°
kcal/mole
IC50
nM
Kd
nM
EC50/IC50
nM
koff
s-1
kon
M-1s-1
pHTemp
°C
Calcitonin gene-related peptide type 1 receptor
(Homo sapiens (Human))
BDBM50268472
((R)-1-(1,4'-bipiperidin-1'-yl)-3-(7-methyl-1H-inda...)
Show SMILES Cc1cc(C[C@@H](OC(=O)N2CCC(CC2)N2Cc3ccccc3NC2=O)C(=O)N2CCC(CC2)N2CCCCC2)cc2cn[nH]c12 |r|
Show InChI InChI=1S/C35H45N7O4/c1-24-19-25(20-27-22-36-38-32(24)27)21-31(33(43)40-15-9-28(10-16-40)39-13-5-2-6-14-39)46-35(45)41-17-11-29(12-18-41)42-23-26-7-3-4-8-30(26)37-34(42)44/h3-4,7-8,19-20,22,28-29,31H,2,5-6,9-18,21,23H2,1H3,(H,36,38)(H,37,44)/t31-/m1/s1
Reactome pathway
n/an/a 0.0100n/an/an/an/an/an/a
Bristol-Myers Squibb Research and Development
Curated by ChEMBL
Assay Description
Antagonist activity at human cloned CGRP receptor expressed in mouse E10 cells assessed as inhibition of CGRP-induced cAMP production
Bioorg Med Chem Lett 19: 3555-8 (2009)
Article DOI: 10.1016/j.bmcl.2009.04.150
BindingDB Entry DOI: 10.7270/Q2WM1DBQ