null
SMILES: C[C@@H]1NC(=O)[C@@H](Cc2c[nH]c3ccccc23)NC(=O)[C@H](Cc2ccccc2)NC(=O)[C@H]2CCCN2C1=O
InChI Key: InChIKey=OTUDCPUMJPNZRR-UYGLSEIWSA-N
Activity Spreadsheet -- Enzyme Inhibition Constant Data from BindingDB
Found 10 hits for monomerid = 50268531
Trg + Lig
Ki
nM
ΔG°
kcal/mole
IC50
nM
Kd
nM
EC50/IC50
nM
koff
s-1
kon
M-1s-1
pHTemp
°C
Delta-type opioid receptor
(Homo sapiens (Human))
BDBM50268531
(CHEMBL499595 | c[L-Ala-D-pro-L-Phe-D-trp])
Show SMILES C[C@@H]1NC(=O)[C@@H](Cc2c[nH]c3ccccc23)NC(=O)[C@H](Cc2ccccc2)NC(=O)[C@H]2CCCN2C1=O |r|
Show InChI InChI=1S/C28H31N5O4/c1-17-28(37)33-13-7-12-24(33)27(36)32-22(14-18-8-3-2-4-9-18)26(35)31-23(25(34)30-17)15-19-16-29-21-11-6-5-10-20(19)21/h2-6,8-11,16-17,22-24,29H,7,12-15H2,1H3,(H,30,34)(H,31,35)(H,32,36)/t17-,22-,23+,24+/m0/s1
Reactome pathway
>1.00E+3n/an/an/an/an/an/an/an/a
Adolor Corporation
Curated by ChEMBL
Assay Description
Displacement of [3H]diprenorphine from human cloned delta receptor by cell based assay
Bioorg Med Chem Lett 19: 3647-50 (2009)
Article DOI: 10.1016/j.bmcl.2009.04.105
BindingDB Entry DOI: 10.7270/Q2HT2Q8K
Mu-type opioid receptor
(Homo sapiens (Human))
BDBM50268531
(CHEMBL499595 | c[L-Ala-D-pro-L-Phe-D-trp])
Show SMILES C[C@@H]1NC(=O)[C@@H](Cc2c[nH]c3ccccc23)NC(=O)[C@H](Cc2ccccc2)NC(=O)[C@H]2CCCN2C1=O |r|
Show InChI InChI=1S/C28H31N5O4/c1-17-28(37)33-13-7-12-24(33)27(36)32-22(14-18-8-3-2-4-9-18)26(35)31-23(25(34)30-17)15-19-16-29-21-11-6-5-10-20(19)21/h2-6,8-11,16-17,22-24,29H,7,12-15H2,1H3,(H,30,34)(H,31,35)(H,32,36)/t17-,22-,23+,24+/m0/s1
NCI pathway
Reactome pathway
n/an/a 48n/an/an/an/an/an/a
Adolor Corporation
Curated by ChEMBL
Assay Description
Antagonist activity at human cloned mu opioid receptor assessed as inhibition of 100 nM loperamide-stimulated GTPgammaS binding by cell based assay
Bioorg Med Chem Lett 19: 3647-50 (2009)
Article DOI: 10.1016/j.bmcl.2009.04.105
BindingDB Entry DOI: 10.7270/Q2HT2Q8K
Kappa-type opioid receptor
(Homo sapiens (Human))
BDBM50268531
(CHEMBL499595 | c[L-Ala-D-pro-L-Phe-D-trp])
Show SMILES C[C@@H]1NC(=O)[C@@H](Cc2c[nH]c3ccccc23)NC(=O)[C@H](Cc2ccccc2)NC(=O)[C@H]2CCCN2C1=O |r|
Show InChI InChI=1S/C28H31N5O4/c1-17-28(37)33-13-7-12-24(33)27(36)32-22(14-18-8-3-2-4-9-18)26(35)31-23(25(34)30-17)15-19-16-29-21-11-6-5-10-20(19)21/h2-6,8-11,16-17,22-24,29H,7,12-15H2,1H3,(H,30,34)(H,31,35)(H,32,36)/t17-,22-,23+,24+/m0/s1
Reactome pathway
n/an/a 5n/an/an/an/an/an/a
Adolor Corporation
Curated by ChEMBL
Assay Description
Antagonist activity at human cloned kappa opioid receptor assessed as inhibition of 50 nM U50488H-stimulated GTPgammaS binding by cell based assay
Bioorg Med Chem Lett 19: 3647-50 (2009)
Article DOI: 10.1016/j.bmcl.2009.04.105
BindingDB Entry DOI: 10.7270/Q2HT2Q8K
Kappa-type opioid receptor
(Homo sapiens (Human))
BDBM50268531
(CHEMBL499595 | c[L-Ala-D-pro-L-Phe-D-trp])
Show SMILES C[C@@H]1NC(=O)[C@@H](Cc2c[nH]c3ccccc23)NC(=O)[C@H](Cc2ccccc2)NC(=O)[C@H]2CCCN2C1=O |r|
Show InChI InChI=1S/C28H31N5O4/c1-17-28(37)33-13-7-12-24(33)27(36)32-22(14-18-8-3-2-4-9-18)26(35)31-23(25(34)30-17)15-19-16-29-21-11-6-5-10-20(19)21/h2-6,8-11,16-17,22-24,29H,7,12-15H2,1H3,(H,30,34)(H,31,35)(H,32,36)/t17-,22-,23+,24+/m0/s1
Reactome pathway
5.20n/an/an/an/an/an/an/an/a
Adolor Corporation
Curated by ChEMBL
Assay Description
Displacement of [3H]diprenorphine from human cloned kappa opioid receptor by cell based assay
Bioorg Med Chem Lett 19: 3647-50 (2009)
Article DOI: 10.1016/j.bmcl.2009.04.105
BindingDB Entry DOI: 10.7270/Q2HT2Q8K
Kappa-type opioid receptor
(Homo sapiens (Human))
BDBM50268531
(CHEMBL499595 | c[L-Ala-D-pro-L-Phe-D-trp])
Show SMILES C[C@@H]1NC(=O)[C@@H](Cc2c[nH]c3ccccc23)NC(=O)[C@H](Cc2ccccc2)NC(=O)[C@H]2CCCN2C1=O |r|
Show InChI InChI=1S/C28H31N5O4/c1-17-28(37)33-13-7-12-24(33)27(36)32-22(14-18-8-3-2-4-9-18)26(35)31-23(25(34)30-17)15-19-16-29-21-11-6-5-10-20(19)21/h2-6,8-11,16-17,22-24,29H,7,12-15H2,1H3,(H,30,34)(H,31,35)(H,32,36)/t17-,22-,23+,24+/m0/s1
Reactome pathway
n/an/a 0.810n/an/an/an/an/an/a
TBA
Citation and Details
Article DOI: 10.1021/acs.jmedchem.0c01915
BindingDB Entry DOI: 10.7270/Q22B931S
Mu-type opioid receptor
(Rattus norvegicus (rat))
BDBM50268531
(CHEMBL499595 | c[L-Ala-D-pro-L-Phe-D-trp])
Show SMILES C[C@@H]1NC(=O)[C@@H](Cc2c[nH]c3ccccc23)NC(=O)[C@H](Cc2ccccc2)NC(=O)[C@H]2CCCN2C1=O |r|
Show InChI InChI=1S/C28H31N5O4/c1-17-28(37)33-13-7-12-24(33)27(36)32-22(14-18-8-3-2-4-9-18)26(35)31-23(25(34)30-17)15-19-16-29-21-11-6-5-10-20(19)21/h2-6,8-11,16-17,22-24,29H,7,12-15H2,1H3,(H,30,34)(H,31,35)(H,32,36)/t17-,22-,23+,24+/m0/s1
Reactome pathway
27n/an/an/an/an/an/an/an/a
TBA
Citation and Details
Article DOI: 10.1021/acs.jmedchem.0c01915
BindingDB Entry DOI: 10.7270/Q22B931S
Delta-type opioid receptor
(MOUSE)
BDBM50268531
(CHEMBL499595 | c[L-Ala-D-pro-L-Phe-D-trp])
Show SMILES C[C@@H]1NC(=O)[C@@H](Cc2c[nH]c3ccccc23)NC(=O)[C@H](Cc2ccccc2)NC(=O)[C@H]2CCCN2C1=O |r|
Show InChI InChI=1S/C28H31N5O4/c1-17-28(37)33-13-7-12-24(33)27(36)32-22(14-18-8-3-2-4-9-18)26(35)31-23(25(34)30-17)15-19-16-29-21-11-6-5-10-20(19)21/h2-6,8-11,16-17,22-24,29H,7,12-15H2,1H3,(H,30,34)(H,31,35)(H,32,36)/t17-,22-,23+,24+/m0/s1
Reactome pathway
8.33E+3n/an/an/an/an/an/an/an/a
TBA
Citation and Details
Article DOI: 10.1021/acs.jmedchem.0c01915
BindingDB Entry DOI: 10.7270/Q22B931S
Kappa-type opioid receptor
(Rattus norvegicus (rat))
BDBM50268531
(CHEMBL499595 | c[L-Ala-D-pro-L-Phe-D-trp])
Show SMILES C[C@@H]1NC(=O)[C@@H](Cc2c[nH]c3ccccc23)NC(=O)[C@H](Cc2ccccc2)NC(=O)[C@H]2CCCN2C1=O |r|
Show InChI InChI=1S/C28H31N5O4/c1-17-28(37)33-13-7-12-24(33)27(36)32-22(14-18-8-3-2-4-9-18)26(35)31-23(25(34)30-17)15-19-16-29-21-11-6-5-10-20(19)21/h2-6,8-11,16-17,22-24,29H,7,12-15H2,1H3,(H,30,34)(H,31,35)(H,32,36)/t17-,22-,23+,24+/m0/s1
Reactome pathway
3.10n/an/an/an/an/an/an/an/a
TBA
Citation and Details
Article DOI: 10.1021/acs.jmedchem.0c01915
BindingDB Entry DOI: 10.7270/Q22B931S
Mu-type opioid receptor
(Homo sapiens (Human))
BDBM50268531
(CHEMBL499595 | c[L-Ala-D-pro-L-Phe-D-trp])
Show SMILES C[C@@H]1NC(=O)[C@@H](Cc2c[nH]c3ccccc23)NC(=O)[C@H](Cc2ccccc2)NC(=O)[C@H]2CCCN2C1=O |r|
Show InChI InChI=1S/C28H31N5O4/c1-17-28(37)33-13-7-12-24(33)27(36)32-22(14-18-8-3-2-4-9-18)26(35)31-23(25(34)30-17)15-19-16-29-21-11-6-5-10-20(19)21/h2-6,8-11,16-17,22-24,29H,7,12-15H2,1H3,(H,30,34)(H,31,35)(H,32,36)/t17-,22-,23+,24+/m0/s1
NCI pathway
Reactome pathway
n/an/a 8.10n/an/an/an/an/an/a
TBA
Citation and Details
Article DOI: 10.1021/acs.jmedchem.0c01915
BindingDB Entry DOI: 10.7270/Q22B931S
Mu-type opioid receptor
(Homo sapiens (Human))
BDBM50268531
(CHEMBL499595 | c[L-Ala-D-pro-L-Phe-D-trp])
Show SMILES C[C@@H]1NC(=O)[C@@H](Cc2c[nH]c3ccccc23)NC(=O)[C@H](Cc2ccccc2)NC(=O)[C@H]2CCCN2C1=O |r|
Show InChI InChI=1S/C28H31N5O4/c1-17-28(37)33-13-7-12-24(33)27(36)32-22(14-18-8-3-2-4-9-18)26(35)31-23(25(34)30-17)15-19-16-29-21-11-6-5-10-20(19)21/h2-6,8-11,16-17,22-24,29H,7,12-15H2,1H3,(H,30,34)(H,31,35)(H,32,36)/t17-,22-,23+,24+/m0/s1
NCI pathway
Reactome pathway
22n/an/an/an/an/an/an/an/a
Adolor Corporation
Curated by ChEMBL
Assay Description
Displacement of [3H]diprenorphine from human cloned mu receptor by cell based assay
Bioorg Med Chem Lett 19: 3647-50 (2009)
Article DOI: 10.1016/j.bmcl.2009.04.105
BindingDB Entry DOI: 10.7270/Q2HT2Q8K