BDBM50268909 CHEMBL4088064
SMILES: CCCCCCNc1cc(NC2CCN(C)CC2)c2cc(OC)c(OC)cc2n1
InChI Key: InChIKey=KLWZLAHWDCVBRC-UHFFFAOYSA-N
Data: 2 IC50
Activity Spreadsheet -- Enzyme Inhibition Constant Data from BindingDB
Found 2 hits for monomerid = 50268909
Trg + Lig
Ki
nM
ΔG°
kcal/mole
IC50
nM
Kd
nM
EC50/IC50
nM
koff
s-1
kon
M-1s-1
pHTemp
°C
Histone-lysine N-methyltransferase EHMT1
(Homo sapiens (Human))
BDBM50268909
(CHEMBL4088064)
Show SMILES CCCCCCNc1cc(NC2CCN(C)CC2)c2cc(OC)c(OC)cc2n1
Show InChI InChI=1S/C23H36N4O2/c1-5-6-7-8-11-24-23-16-20(25-17-9-12-27(2)13-10-17)18-14-21(28-3)22(29-4)15-19(18)26-23/h14-17H,5-13H2,1-4H3,(H2,24,25,26)
Reactome pathway
n/an/a 11n/an/an/an/an/an/a
Icahn School of Medicine at Mount Sinai
Curated by ChEMBL
Assay Description
Inhibition of human GLP catalytic domain (951 to 1235 residues) expressed in Escherichia coli BL21 (DE3) using biotinylated H3 (1 to 25 residues) as ...
Bioorg Med Chem 25: 4414-4423 (2017)
Article DOI: 10.1016/j.bmc.2017.06.021
BindingDB Entry DOI: 10.7270/Q2X350ZG
Protein G9a (G9a)
(Homo sapiens (Human))
BDBM50268909
(CHEMBL4088064)
Show SMILES CCCCCCNc1cc(NC2CCN(C)CC2)c2cc(OC)c(OC)cc2n1
Show InChI InChI=1S/C23H36N4O2/c1-5-6-7-8-11-24-23-16-20(25-17-9-12-27(2)13-10-17)18-14-21(28-3)22(29-4)15-19(18)26-23/h14-17H,5-13H2,1-4H3,(H2,24,25,26)
n/an/a 110n/an/an/an/an/an/a
Icahn School of Medicine at Mount Sinai
Curated by ChEMBL
Assay Description
Inhibition of human G9a catalytic domain (913 to 1193 residues) expressed in Escherichia coli BL21 (DE3) using biotinylated H3 (1 to 25 residues) as ...
Bioorg Med Chem 25: 4414-4423 (2017)
Article DOI: 10.1016/j.bmc.2017.06.021
BindingDB Entry DOI: 10.7270/Q2X350ZG