BDBM50269236 3 beta-O-acetyloleanolic acid::CHEMBL503071
SMILES: COC(=O)[C@H]1CC[C@@]2(C)[C@@H](CC[C@]3(C)[C@@H]2CC=C2[C@@H]4CC(C)(C)CC[C@@]4(CC[C@@]32C)C(O)=O)C1(C)C
InChI Key: InChIKey=HDWYAPCZHCDUNP-JVZQWSIASA-N
Data: 2 IC50
Activity Spreadsheet -- Enzyme Inhibition Constant Data from BindingDB
Found 2 hits for monomerid = 50269236
Trg + Lig
Ki
nM
ΔG°
kcal/mole
IC50
nM
Kd
nM
EC50/IC50
nM
koff
s-1
kon
M-1s-1
pHTemp
°C
Cyclooxygenase
(Homo sapiens (Human))
BDBM50269236
(3 beta-O-acetyloleanolic acid | CHEMBL503071)
Show SMILES COC(=O)[C@H]1CC[C@@]2(C)[C@@H](CC[C@]3(C)[C@@H]2CC=C2[C@@H]4CC(C)(C)CC[C@@]4(CC[C@@]32C)C(O)=O)C1(C)C |r,t:17|
Show InChI InChI=1S/C32H50O4/c1-27(2)15-17-32(26(34)35)18-16-30(6)20(22(32)19-27)9-10-24-29(5)13-11-21(25(33)36-8)28(3,4)23(29)12-14-31(24,30)7/h9,21-24H,10-19H2,1-8H3,(H,34,35)/t21-,22+,23+,24-,29+,30-,31-,32+/m1/s1
NCI pathway
Reactome pathway
n/an/a 2.20E+3n/an/an/an/an/an/a
Centro de Investigaciones Químicas de la Universidad Autónoma del Estado de Morelos
Curated by ChEMBL
Assay Description
Inhibition of human recombinant COX2
J Nat Prod 69: 887-90 (2006)
Article DOI: 10.1021/np0504311
BindingDB Entry DOI: 10.7270/Q2DJ5FDH
Prostaglandin G/H synthase (cyclooxygenase)
(Ovis aries (Sheep))
BDBM50269236
(3 beta-O-acetyloleanolic acid | CHEMBL503071)
Show SMILES COC(=O)[C@H]1CC[C@@]2(C)[C@@H](CC[C@]3(C)[C@@H]2CC=C2[C@@H]4CC(C)(C)CC[C@@]4(CC[C@@]32C)C(O)=O)C1(C)C |r,t:17|
Show InChI InChI=1S/C32H50O4/c1-27(2)15-17-32(26(34)35)18-16-30(6)20(22(32)19-27)9-10-24-29(5)13-11-21(25(33)36-8)28(3,4)23(29)12-14-31(24,30)7/h9,21-24H,10-19H2,1-8H3,(H,34,35)/t21-,22+,23+,24-,29+,30-,31-,32+/m1/s1
n/an/a 1n/an/an/an/an/an/a
Centro de Investigaciones Químicas de la Universidad Autónoma del Estado de Morelos
Curated by ChEMBL
Assay Description
Inhibition of ovine COX1
J Nat Prod 69: 887-90 (2006)
Article DOI: 10.1021/np0504311
BindingDB Entry DOI: 10.7270/Q2DJ5FDH