BDBM50269426 CHEMBL3719193
SMILES: C[C@@H]1CN(CCN1c1nc(cc(=O)n1C)-c1ccncn1)c1ccccc1
InChI Key: InChIKey=MXORTFNDXYFZRN-OAHLLOKOSA-N
Data: 4 IC50
Activity Spreadsheet -- Enzyme Inhibition Constant Data from BindingDB
Found 4 hits for monomerid = 50269426
Trg + Lig
Ki
nM
ΔG°
kcal/mole
IC50
nM
Kd
nM
EC50/IC50
nM
koff
s-1
kon
M-1s-1
pHTemp
°C
Glycogen synthase kinase-3 beta
(Homo sapiens (Human))
BDBM50269426
(CHEMBL3719193)
Show SMILES C[C@@H]1CN(CCN1c1nc(cc(=O)n1C)-c1ccncn1)c1ccccc1 |r|
Show InChI InChI=1S/C20H22N6O/c1-15-13-25(16-6-4-3-5-7-16)10-11-26(15)20-23-18(12-19(27)24(20)2)17-8-9-21-14-22-17/h3-9,12,14-15H,10-11,13H2,1-2H3/t15-/m1/s1
NCI pathway
Reactome pathway
n/an/a 1.40n/an/an/an/an/an/a
Sohyaku, Innovative Research Division, Mitsubishi Tanabe Pharma Corporation, 1000, Kamoshida-cho, Aoba-ku, Yokohama 227-0033, Japan.
Curated by ChEMBL
Assay Description
Inhibition of human GSK-3beta using prephosphorylated-GS1 peptide as substrate after 1 hr in presence of [gamma-32P]ATP by liquid scintillation spect...
Bioorg Med Chem Lett 27: 3733-3738 (2017)
Article DOI: 10.1016/j.bmcl.2017.06.077
BindingDB Entry DOI: 10.7270/Q2XW4N9C
Cytochrome P450 3A4
(Homo sapiens (Human))
BDBM50269426
(CHEMBL3719193)
Show SMILES C[C@@H]1CN(CCN1c1nc(cc(=O)n1C)-c1ccncn1)c1ccccc1 |r|
Show InChI InChI=1S/C20H22N6O/c1-15-13-25(16-6-4-3-5-7-16)10-11-26(15)20-23-18(12-19(27)24(20)2)17-8-9-21-14-22-17/h3-9,12,14-15H,10-11,13H2,1-2H3/t15-/m1/s1
Reactome pathway
n/an/a>5.00E+4n/an/an/an/an/an/a
Sohyaku, Innovative Research Division, Mitsubishi Tanabe Pharma Corporation, 1000, Kamoshida-cho, Aoba-ku, Yokohama 227-0033, Japan.
Curated by ChEMBL
Assay Description
Inhibition of recombinant human CYP3A4
Bioorg Med Chem Lett 27: 3733-3738 (2017)
Article DOI: 10.1016/j.bmcl.2017.06.077
BindingDB Entry DOI: 10.7270/Q2XW4N9C
Cytochrome P450 1A
(Homo sapiens (Human))
BDBM50269426
(CHEMBL3719193)
Show SMILES C[C@@H]1CN(CCN1c1nc(cc(=O)n1C)-c1ccncn1)c1ccccc1 |r|
Show InChI InChI=1S/C20H22N6O/c1-15-13-25(16-6-4-3-5-7-16)10-11-26(15)20-23-18(12-19(27)24(20)2)17-8-9-21-14-22-17/h3-9,12,14-15H,10-11,13H2,1-2H3/t15-/m1/s1
Reactome pathway
n/an/a>5.00E+4n/an/an/an/an/an/a
Sohyaku, Innovative Research Division, Mitsubishi Tanabe Pharma Corporation, 1000, Kamoshida-cho, Aoba-ku, Yokohama 227-0033, Japan.
Curated by ChEMBL
Assay Description
Inhibition of recombinant human CYP1A2
Bioorg Med Chem Lett 27: 3733-3738 (2017)
Article DOI: 10.1016/j.bmcl.2017.06.077
BindingDB Entry DOI: 10.7270/Q2XW4N9C
Cytochrome P450 2D6
(Homo sapiens (Human))
BDBM50269426
(CHEMBL3719193)
Show SMILES C[C@@H]1CN(CCN1c1nc(cc(=O)n1C)-c1ccncn1)c1ccccc1 |r|
Show InChI InChI=1S/C20H22N6O/c1-15-13-25(16-6-4-3-5-7-16)10-11-26(15)20-23-18(12-19(27)24(20)2)17-8-9-21-14-22-17/h3-9,12,14-15H,10-11,13H2,1-2H3/t15-/m1/s1
n/an/a 2.30E+4n/an/an/an/an/an/a
Sohyaku, Innovative Research Division, Mitsubishi Tanabe Pharma Corporation, 1000, Kamoshida-cho, Aoba-ku, Yokohama 227-0033, Japan.
Curated by ChEMBL
Assay Description
Inhibition of recombinant human CYP2D6
Bioorg Med Chem Lett 27: 3733-3738 (2017)
Article DOI: 10.1016/j.bmcl.2017.06.077
BindingDB Entry DOI: 10.7270/Q2XW4N9C