BDBM50269530 (9Z)-tetradec-9-enoic acid::CHEMBL456732::cis-Delta(9)-tetradecenoic acid::myristoleic acid
SMILES: CCCC\C=C/CCCCCCCC(O)=O
InChI Key: InChIKey=YWWVWXASSLXJHU-WAYWQWQTSA-N
Data: 2 IC50
PDB links: 1 PDB ID matches this monomer.
Activity Spreadsheet -- Enzyme Inhibition Constant Data from BindingDB
Found 2 hits for monomerid = 50269530
Trg + Lig
Ki
nM
ΔG°
kcal/mole
IC50
nM
Kd
nM
EC50/IC50
nM
koff
s-1
kon
M-1s-1
pHTemp
°C
Coagulation factor VII/tissue factor
(Homo sapiens (Human))
BDBM50269530
((9Z)-tetradec-9-enoic acid | CHEMBL456732 | cis-De...)
Show SMILES CCCC\C=C/CCCCCCCC(O)=O
Show InChI InChI=1S/C14H26O2/c1-2-3-4-5-6-7-8-9-10-11-12-13-14(15)16/h5-6H,2-4,7-13H2,1H3,(H,15,16)/b6-5-
Reactome pathway
n/an/a 6.60E+4n/an/an/an/an/an/a
Searle Discovery Research
Curated by ChEMBL
Assay Description
Inhibition of amidolytic activity of human tissue factor/human factor 7a
J Nat Prod 61: 1352-5 (1999)
Article DOI: 10.1021/np980117p
BindingDB Entry DOI: 10.7270/Q2SF2VXF
Trypsin
(Sus scrofa)
BDBM50269530
((9Z)-tetradec-9-enoic acid | CHEMBL456732 | cis-De...)
Show SMILES CCCC\C=C/CCCCCCCC(O)=O
Show InChI InChI=1S/C14H26O2/c1-2-3-4-5-6-7-8-9-10-11-12-13-14(15)16/h5-6H,2-4,7-13H2,1H3,(H,15,16)/b6-5-
n/an/a>2.00E+5n/an/an/an/an/an/a
Searle Discovery Research
Curated by ChEMBL
Assay Description
Inhibition of pig pancreatic trypsin after 15 mins
J Nat Prod 61: 1352-5 (1999)
Article DOI: 10.1021/np980117p
BindingDB Entry DOI: 10.7270/Q2SF2VXF