BDBM50269540 6-(8'Z,11'Z-heptadecadienyl)-salicylicacid::CHEMBL465196
SMILES: CCCCC\C=C/C\C=C/CCCCCCCc1cccc(O)c1C(O)=O
InChI Key: InChIKey=OFFQPVDOVYHTBX-HZJYTTRNSA-N
Data: 2 IC50
Activity Spreadsheet -- Enzyme Inhibition Constant Data from BindingDB
Found 2 hits for monomerid = 50269540
Trg + Lig
Ki
nM
ΔG°
kcal/mole
IC50
nM
Kd
nM
EC50/IC50
nM
koff
s-1
kon
M-1s-1
pHTemp
°C
Coagulation factor VII/tissue factor
(Homo sapiens (Human))
BDBM50269540
(6-(8'Z,11'Z-heptadecadienyl)-salicylicacid | CHEMB...)
Show SMILES CCCCC\C=C/C\C=C/CCCCCCCc1cccc(O)c1C(O)=O
Show InChI InChI=1S/C24H36O3/c1-2-3-4-5-6-7-8-9-10-11-12-13-14-15-16-18-21-19-17-20-22(25)23(21)24(26)27/h6-7,9-10,17,19-20,25H,2-5,8,11-16,18H2,1H3,(H,26,27)/b7-6-,10-9-
Reactome pathway
n/an/a 3.30E+4n/an/an/an/an/an/a
Searle Discovery Research
Curated by ChEMBL
Assay Description
Inhibition of amidolytic activity of human tissue factor/human factor 7a
J Nat Prod 61: 1352-5 (1999)
Article DOI: 10.1021/np980117p
BindingDB Entry DOI: 10.7270/Q2SF2VXF
Trypsin
(Sus scrofa)
BDBM50269540
(6-(8'Z,11'Z-heptadecadienyl)-salicylicacid | CHEMB...)
Show SMILES CCCCC\C=C/C\C=C/CCCCCCCc1cccc(O)c1C(O)=O
Show InChI InChI=1S/C24H36O3/c1-2-3-4-5-6-7-8-9-10-11-12-13-14-15-16-18-21-19-17-20-22(25)23(21)24(26)27/h6-7,9-10,17,19-20,25H,2-5,8,11-16,18H2,1H3,(H,26,27)/b7-6-,10-9-
n/an/a>2.00E+5n/an/an/an/an/an/a
Searle Discovery Research
Curated by ChEMBL
Assay Description
Inhibition of pig pancreatic trypsin after 15 mins
J Nat Prod 61: 1352-5 (1999)
Article DOI: 10.1021/np980117p
BindingDB Entry DOI: 10.7270/Q2SF2VXF