BDBM50269547 5-desgalloylstachyurin::CHEMBL488110
SMILES: O[C@@H]1[C@@H]2OC(=O)c3c1c(O)c(O)c(O)c3-c1c(O)c(O)c(O)cc1C(=O)O[C@H]2[C@@H]1OC(=O)c2cc(O)c(O)c(O)c2-c2c(O)c(O)c(O)cc2C(=O)OC[C@H]1O
InChI Key: InChIKey=CHBITXAMNKHJCR-VGYCLGPVSA-N
Data: 2 KI  3 IC50
Activity Spreadsheet -- Enzyme Inhibition Constant Data from BindingDB
Found 5 hits for monomerid = 50269547
Trg + Lig
Ki
nM
ΔG°
kcal/mole
IC50
nM
Kd
nM
EC50/IC50
nM
koff
s-1
kon
M-1s-1
pHTemp
°C
Coagulation factor X
(Homo sapiens (Human))
BDBM50269547
(5-desgalloylstachyurin | CHEMBL488110)
Show SMILES O[C@@H]1[C@@H]2OC(=O)c3c1c(O)c(O)c(O)c3-c1c(O)c(O)c(O)cc1C(=O)O[C@H]2[C@@H]1OC(=O)c2cc(O)c(O)c(O)c2-c2c(O)c(O)c(O)cc2C(=O)OC[C@H]1O |r|
Show InChI InChI=1S/C34H24O22/c35-8-1-5-12(21(42)18(8)39)13-6(2-9(36)19(40)22(13)43)32(50)54-28(11(38)4-53-31(5)49)30-29-26(47)17-16(34(52)55-29)15(24(45)27(48)25(17)46)14-7(33(51)56-30)3-10(37)20(41)23(14)44/h1-3,11,26,28-30,35-48H,4H2/t11-,26+,28-,29+,30+/m1/s1
Reactome pathway
690n/an/an/an/an/an/an/an/a
National University of Singapore
Curated by ChEMBL
Assay Description
Inhibition of human factor 10a
J Nat Prod 61: 1356-60 (1999)
Article DOI: 10.1021/np9801458
BindingDB Entry DOI: 10.7270/Q2NP2452
Thrombin
(Bos taurus (Bovine))
BDBM50269547
(5-desgalloylstachyurin | CHEMBL488110)
Show SMILES O[C@@H]1[C@@H]2OC(=O)c3c1c(O)c(O)c(O)c3-c1c(O)c(O)c(O)cc1C(=O)O[C@H]2[C@@H]1OC(=O)c2cc(O)c(O)c(O)c2-c2c(O)c(O)c(O)cc2C(=O)OC[C@H]1O |r|
Show InChI InChI=1S/C34H24O22/c35-8-1-5-12(21(42)18(8)39)13-6(2-9(36)19(40)22(13)43)32(50)54-28(11(38)4-53-31(5)49)30-29-26(47)17-16(34(52)55-29)15(24(45)27(48)25(17)46)14-7(33(51)56-30)3-10(37)20(41)23(14)44/h1-3,11,26,28-30,35-48H,4H2/t11-,26+,28-,29+,30+/m1/s1
830n/an/an/an/an/an/an/an/a
National University of Singapore
Curated by ChEMBL
Assay Description
Inhibition of bovine thrombin by Lineweaver-Burk plot analysis
J Nat Prod 61: 1356-60 (1999)
Article DOI: 10.1021/np9801458
BindingDB Entry DOI: 10.7270/Q2NP2452
Thrombin
(Bos taurus (Bovine))
BDBM50269547
(5-desgalloylstachyurin | CHEMBL488110)
Show SMILES O[C@@H]1[C@@H]2OC(=O)c3c1c(O)c(O)c(O)c3-c1c(O)c(O)c(O)cc1C(=O)O[C@H]2[C@@H]1OC(=O)c2cc(O)c(O)c(O)c2-c2c(O)c(O)c(O)cc2C(=O)OC[C@H]1O |r|
Show InChI InChI=1S/C34H24O22/c35-8-1-5-12(21(42)18(8)39)13-6(2-9(36)19(40)22(13)43)32(50)54-28(11(38)4-53-31(5)49)30-29-26(47)17-16(34(52)55-29)15(24(45)27(48)25(17)46)14-7(33(51)56-30)3-10(37)20(41)23(14)44/h1-3,11,26,28-30,35-48H,4H2/t11-,26+,28-,29+,30+/m1/s1
n/an/a 190n/an/an/an/an/an/a
National University of Singapore
Curated by ChEMBL
Assay Description
Inhibition of bovine thrombin-catalyzed hydrolysis of S-2238
J Nat Prod 61: 1356-60 (1999)
Article DOI: 10.1021/np9801458
BindingDB Entry DOI: 10.7270/Q2NP2452
Coagulation factor X
(Homo sapiens (Human))
BDBM50269547
(5-desgalloylstachyurin | CHEMBL488110)
Show SMILES O[C@@H]1[C@@H]2OC(=O)c3c1c(O)c(O)c(O)c3-c1c(O)c(O)c(O)cc1C(=O)O[C@H]2[C@@H]1OC(=O)c2cc(O)c(O)c(O)c2-c2c(O)c(O)c(O)cc2C(=O)OC[C@H]1O |r|
Show InChI InChI=1S/C34H24O22/c35-8-1-5-12(21(42)18(8)39)13-6(2-9(36)19(40)22(13)43)32(50)54-28(11(38)4-53-31(5)49)30-29-26(47)17-16(34(52)55-29)15(24(45)27(48)25(17)46)14-7(33(51)56-30)3-10(37)20(41)23(14)44/h1-3,11,26,28-30,35-48H,4H2/t11-,26+,28-,29+,30+/m1/s1
Reactome pathway
n/an/a 280n/an/an/an/an/an/a
National University of Singapore
Curated by ChEMBL
Assay Description
Inhibition of human factor 10a-catalyzed hydrolysis of S-2222
J Nat Prod 61: 1356-60 (1999)
Article DOI: 10.1021/np9801458
BindingDB Entry DOI: 10.7270/Q2NP2452
Thrombin
(Bos taurus (Bovine))
BDBM50269547
(5-desgalloylstachyurin | CHEMBL488110)
Show SMILES O[C@@H]1[C@@H]2OC(=O)c3c1c(O)c(O)c(O)c3-c1c(O)c(O)c(O)cc1C(=O)O[C@H]2[C@@H]1OC(=O)c2cc(O)c(O)c(O)c2-c2c(O)c(O)c(O)cc2C(=O)OC[C@H]1O |r|
Show InChI InChI=1S/C34H24O22/c35-8-1-5-12(21(42)18(8)39)13-6(2-9(36)19(40)22(13)43)32(50)54-28(11(38)4-53-31(5)49)30-29-26(47)17-16(34(52)55-29)15(24(45)27(48)25(17)46)14-7(33(51)56-30)3-10(37)20(41)23(14)44/h1-3,11,26,28-30,35-48H,4H2/t11-,26+,28-,29+,30+/m1/s1
n/an/a 26n/an/an/an/an/an/a
National University of Singapore
Curated by ChEMBL
Assay Description
Inhibition of bovine thrombin-catalyzed hydrolysis of fibrinogen
J Nat Prod 61: 1356-60 (1999)
Article DOI: 10.1021/np9801458
BindingDB Entry DOI: 10.7270/Q2NP2452