BDBM50269599 5-(gamma,gamma-dimethylallyl)-oxyresveratrol::CHEMBL463126
SMILES: [#6]\[#6](-[#6])=[#6]\[#6]-c1cc(\[#6]=[#6]\c2cc(-[#8])cc(-[#8])c2)c(-[#8])cc1-[#8]
InChI Key: InChIKey=KYQWCQJWDVPXKY-GQCTYLIASA-N
Data: 2 IC50
Activity Spreadsheet -- Enzyme Inhibition Constant Data from BindingDB
Found 2 hits for monomerid = 50269599
Trg + Lig
Ki
nM
ΔG°
kcal/mole
IC50
nM
Kd
nM
EC50/IC50
nM
koff
s-1
kon
M-1s-1
pHTemp
°C
Cyclooxygenase
(Homo sapiens (Human))
BDBM50269599
(5-(gamma,gamma-dimethylallyl)-oxyresveratrol | CHE...)
Show SMILES [#6]\[#6](-[#6])=[#6]\[#6]-c1cc(\[#6]=[#6]\c2cc(-[#8])cc(-[#8])c2)c(-[#8])cc1-[#8]
Show InChI InChI=1S/C19H20O4/c1-12(2)3-5-14-9-15(19(23)11-18(14)22)6-4-13-7-16(20)10-17(21)8-13/h3-4,6-11,20-23H,5H2,1-2H3/b6-4+
NCI pathway
Reactome pathway
n/an/a 3.67E+4n/an/an/an/an/an/a
University of Illinois at Chicago
Curated by ChEMBL
Assay Description
Inhibition of COX2
J Nat Prod 65: 163-9 (2002)
BindingDB Entry DOI: 10.7270/Q2J38TGV
Cyclooxygenase-1 (COX-1)
(Homo sapiens (Human))
BDBM50269599
(5-(gamma,gamma-dimethylallyl)-oxyresveratrol | CHE...)
Show SMILES [#6]\[#6](-[#6])=[#6]\[#6]-c1cc(\[#6]=[#6]\c2cc(-[#8])cc(-[#8])c2)c(-[#8])cc1-[#8]
Show InChI InChI=1S/C19H20O4/c1-12(2)3-5-14-9-15(19(23)11-18(14)22)6-4-13-7-16(20)10-17(21)8-13/h3-4,6-11,20-23H,5H2,1-2H3/b6-4+
n/an/a 4.10E+3n/an/an/an/an/an/a
University of Illinois at Chicago
Curated by ChEMBL
Assay Description
Inhibition of COX1
J Nat Prod 65: 163-9 (2002)
BindingDB Entry DOI: 10.7270/Q2J38TGV