BDBM50269941 (2S,5S)-2-Hydroxymethyl-5-[1'-2'-(2''-quinolyl)-ethynyl]-1-aza-bicyclo-[2.2.2]-octane::CHEMBL478112
SMILES: OC[C@@H]1CC2CCN1C[C@@H]2C#Cc1cnc2ccccc2c1
InChI Key: InChIKey=NCFADVGMVIJELQ-BEEDKBRMSA-N
Data: 1 IC50
Activity Spreadsheet -- Enzyme Inhibition Constant Data from BindingDB
Found 1 hit for monomerid = 50269941
Trg + Lig
Ki
nM
ΔG°
kcal/mole
IC50
nM
Kd
nM
EC50/IC50
nM
koff
s-1
kon
M-1s-1
pHTemp
°C
Farnesyltransferase, putative
(Leishmania major)
BDBM50269941
((2S,5S)-2-Hydroxymethyl-5-[1'-2'-(2''-quinolyl)-et...)
Show SMILES OC[C@@H]1CC2CCN1C[C@@H]2C#Cc1cnc2ccccc2c1 |r|
Show InChI InChI=1S/C19H20N2O/c22-13-18-10-15-7-8-21(18)12-17(15)6-5-14-9-16-3-1-2-4-19(16)20-11-14/h1-4,9,11,15,17-18,22H,7-8,10,12-13H2/t15?,17-,18-/m0/s1
n/an/a>1.00E+3n/an/an/an/an/an/a
Cardiff University
Curated by ChEMBL
Assay Description
Inhibition of Leishmania major recombinant squalene synthase expressed in Escherichia coli by liquid scintillation counter
Antimicrob Agents Chemother 51: 4049-61 (2007)
Article DOI: 10.1128/AAC.00205-07
BindingDB Entry DOI: 10.7270/Q2MS3SJZ