BDBM50269998 (S)-2-((R)-5-chloro-8-hydroxy-3-methyl-1-oxoisochroman-7-carboxamido)-3-phenylpropanoate
SMILES: C[C@@H]1Cc2c(Cl)cc(C(=O)N[C@@H](Cc3ccccc3)C([O-])=O)c(O)c2C(=O)O1
InChI Key: InChIKey=RWQKHEORZBHNRI-BMIGLBTASA-M
Data: 2 KI  1 IC50
Activity Spreadsheet -- Enzyme Inhibition Constant Data from BindingDB
Found 3 hits for monomerid = 50269998
Trg + Lig
Ki
nM
ΔG°
kcal/mole
IC50
nM
Kd
nM
EC50/IC50
nM
koff
s-1
kon
M-1s-1
pHTemp
°C
Solute carrier family 22 member 6
(Mus musculus)
BDBM50269998
((S)-2-((R)-5-chloro-8-hydroxy-3-methyl-1-oxoisochr...)
Show SMILES C[C@@H]1Cc2c(Cl)cc(C(=O)N[C@@H](Cc3ccccc3)C([O-])=O)c(O)c2C(=O)O1 |r|
Show InChI InChI=1S/C20H18ClNO6/c1-10-7-12-14(21)9-13(17(23)16(12)20(27)28-10)18(24)22-15(19(25)26)8-11-5-3-2-4-6-11/h2-6,9-10,15,23H,7-8H2,1H3,(H,22,24)(H,25,26)/p-1/t10-,15+/m1/s1
Reactome pathway
6.31E+3n/an/an/an/an/an/an/an/a
University of California
Curated by ChEMBL
Assay Description
Inhibition of mouse Oat1-mediated [3H]PAH uptake in Xenopus oocytes after 1 hr
J Biol Chem 282: 23841-53 (2007)
Article DOI: 10.1074/jbc.M703467200
BindingDB Entry DOI: 10.7270/Q2W95B35
Solute carrier family 22 member 20
(Mus musculus)
BDBM50269998
((S)-2-((R)-5-chloro-8-hydroxy-3-methyl-1-oxoisochr...)
Show SMILES C[C@@H]1Cc2c(Cl)cc(C(=O)N[C@@H](Cc3ccccc3)C([O-])=O)c(O)c2C(=O)O1 |r|
Show InChI InChI=1S/C20H18ClNO6/c1-10-7-12-14(21)9-13(17(23)16(12)20(27)28-10)18(24)22-15(19(25)26)8-11-5-3-2-4-6-11/h2-6,9-10,15,23H,7-8H2,1H3,(H,22,24)(H,25,26)/p-1/t10-,15+/m1/s1
4.90E+4n/an/an/an/an/an/an/an/a
University of California
Curated by ChEMBL
Assay Description
Inhibition of mouse Oat6-mediated [3H]ES uptake in Xenopus oocytes after 1 hr
J Biol Chem 282: 23841-53 (2007)
Article DOI: 10.1074/jbc.M703467200
BindingDB Entry DOI: 10.7270/Q2W95B35
L-cysteine:1D-myo-inositol 2-amino-2-deoxy-alpha-D-glucopyranoside ligase
(Mycobacterium tuberculosis)
BDBM50269998
((S)-2-((R)-5-chloro-8-hydroxy-3-methyl-1-oxoisochr...)
Show SMILES C[C@@H]1Cc2c(Cl)cc(C(=O)N[C@@H](Cc3ccccc3)C([O-])=O)c(O)c2C(=O)O1 |r|
Show InChI InChI=1S/C20H18ClNO6/c1-10-7-12-14(21)9-13(17(23)16(12)20(27)28-10)18(24)22-15(19(25)26)8-11-5-3-2-4-6-11/h2-6,9-10,15,23H,7-8H2,1H3,(H,22,24)(H,25,26)/p-1/t10-,15+/m1/s1
Reactome pathway
n/an/a 2.50E+6n/an/an/an/an/an/a
National Institute of Diabetes and Digestive and Kidney Diseases
Curated by ChEMBL
Assay Description
Inhibition of Mycobacterium tuberculosis recombinant MBP-tagged MshC assessed as formation of fluorescently labeled Cys-GlcN-Ins by HPLC
Bioorg Med Chem Lett 21: 2480-3 (2011)
Article DOI: 10.1016/j.bmcl.2011.02.042
BindingDB Entry DOI: 10.7270/Q26Q1XKW