BDBM50270298 CHEMBL4075720
SMILES: CN1CCN(Cc2ccc(NC(=O)c3n[nH]cc3Nc3ncnc4sccc34)cc2)CC1
InChI Key: InChIKey=UDVJBRYBBSVDDS-UHFFFAOYSA-N
Data: 26 IC50  3 Kd
Activity Spreadsheet -- Enzyme Inhibition Constant Data from BindingDB
Found 29 hits for monomerid = 50270298
Trg + Lig
Ki
nM
ΔG°
kcal/mole
IC50
nM
Kd
nM
EC50/IC50
nM
koff
s-1
kon
M-1s-1
pHTemp
°C
ALK tyrosine kinase receptor
(Homo sapiens (Human))
BDBM50270298
(CHEMBL4075720)
Show SMILES CN1CCN(Cc2ccc(NC(=O)c3n[nH]cc3Nc3ncnc4sccc34)cc2)CC1
Show InChI InChI=1S/C22H24N8OS/c1-29-7-9-30(10-8-29)13-15-2-4-16(5-3-15)26-21(31)19-18(12-25-28-19)27-20-17-6-11-32-22(17)24-14-23-20/h2-6,11-12,14H,7-10,13H2,1H3,(H,25,28)(H,26,31)(H,23,24,27)
n/an/a 94n/an/an/an/an/an/a
China Pharmaceutical University
Curated by ChEMBL
Assay Description
Inhibition of human ALK using poly[Glu:Tyr] (4:1) as substrate preincubated for 20 mins followed by [gamma-33P]-ATP addition measure after 120 mins b...
J Med Chem 61: 1499-1518 (2018)
Article DOI: 10.1021/acs.jmedchem.7b01261
BindingDB Entry DOI: 10.7270/Q2FR003K
Receptor-type tyrosine-protein kinase FLT3
(Homo sapiens (Human))
BDBM50270298
(CHEMBL4075720)
Show SMILES CN1CCN(Cc2ccc(NC(=O)c3n[nH]cc3Nc3ncnc4sccc34)cc2)CC1
Show InChI InChI=1S/C22H24N8OS/c1-29-7-9-30(10-8-29)13-15-2-4-16(5-3-15)26-21(31)19-18(12-25-28-19)27-20-17-6-11-32-22(17)24-14-23-20/h2-6,11-12,14H,7-10,13H2,1H3,(H,25,28)(H,26,31)(H,23,24,27)
n/an/an/a 0.230n/an/an/an/an/a
China Pharmaceutical University
Curated by ChEMBL
Assay Description
Binding affinity to human FLT3 ITD/D835V double mutant expressed in bacterial expression system by Kinomescan method
Eur J Med Chem 155: 303-315 (2018)
Article DOI: 10.1016/j.ejmech.2018.06.010
BindingDB Entry DOI: 10.7270/Q2668GSP
Vascular endothelial growth factor receptor 1
(Homo sapiens (Human))
BDBM50270298
(CHEMBL4075720)
Show SMILES CN1CCN(Cc2ccc(NC(=O)c3n[nH]cc3Nc3ncnc4sccc34)cc2)CC1
Show InChI InChI=1S/C22H24N8OS/c1-29-7-9-30(10-8-29)13-15-2-4-16(5-3-15)26-21(31)19-18(12-25-28-19)27-20-17-6-11-32-22(17)24-14-23-20/h2-6,11-12,14H,7-10,13H2,1H3,(H,25,28)(H,26,31)(H,23,24,27)
n/an/a 20n/an/an/an/an/an/a
China Pharmaceutical University
Curated by ChEMBL
Assay Description
Inhibition of human FLT1 using poly[Glu:Tyr] (4:1) as substrate preincubated for 20 mins followed by [gamma-33P]-ATP addition measure after 120 mins ...
J Med Chem 61: 1499-1518 (2018)
Article DOI: 10.1021/acs.jmedchem.7b01261
BindingDB Entry DOI: 10.7270/Q2FR003K
Cyclin-dependent kinase 6/G1/S-specific cyclin-D1
(Homo sapiens (Human))
BDBM50270298
(CHEMBL4075720)
Show SMILES CN1CCN(Cc2ccc(NC(=O)c3n[nH]cc3Nc3ncnc4sccc34)cc2)CC1
Show InChI InChI=1S/C22H24N8OS/c1-29-7-9-30(10-8-29)13-15-2-4-16(5-3-15)26-21(31)19-18(12-25-28-19)27-20-17-6-11-32-22(17)24-14-23-20/h2-6,11-12,14H,7-10,13H2,1H3,(H,25,28)(H,26,31)(H,23,24,27)
n/an/a 4.20n/an/an/an/an/an/a
China Pharmaceutical University
Curated by ChEMBL
Assay Description
Inhibition of human CDK6/Cyclin D1 using RB protein as substrate preincubated for 20 mins followed by [gamma-33P]-ATP addition measure after 120 mins...
J Med Chem 61: 1499-1518 (2018)
Article DOI: 10.1021/acs.jmedchem.7b01261
BindingDB Entry DOI: 10.7270/Q2FR003K
Cyclin-dependent kinase 4/G1/S-specific cyclin-D1
(Homo sapiens (Human))
BDBM50270298
(CHEMBL4075720)
Show SMILES CN1CCN(Cc2ccc(NC(=O)c3n[nH]cc3Nc3ncnc4sccc34)cc2)CC1
Show InChI InChI=1S/C22H24N8OS/c1-29-7-9-30(10-8-29)13-15-2-4-16(5-3-15)26-21(31)19-18(12-25-28-19)27-20-17-6-11-32-22(17)24-14-23-20/h2-6,11-12,14H,7-10,13H2,1H3,(H,25,28)(H,26,31)(H,23,24,27)
NCI pathway
Reactome pathway
n/an/a 3.30n/an/an/an/an/an/a
China Pharmaceutical University
Curated by ChEMBL
Assay Description
Inhibition of human CDK4/Cyclin D1 using RB protein as substrate preincubated for 20 mins followed by [gamma-33P]-ATP addition measure after 120 mins...
J Med Chem 61: 1499-1518 (2018)
Article DOI: 10.1021/acs.jmedchem.7b01261
BindingDB Entry DOI: 10.7270/Q2FR003K
Cyclin-A1/Cyclin-dependent kinase 2
(Homo sapiens (Human))
BDBM50270298
(CHEMBL4075720)
Show SMILES CN1CCN(Cc2ccc(NC(=O)c3n[nH]cc3Nc3ncnc4sccc34)cc2)CC1
Show InChI InChI=1S/C22H24N8OS/c1-29-7-9-30(10-8-29)13-15-2-4-16(5-3-15)26-21(31)19-18(12-25-28-19)27-20-17-6-11-32-22(17)24-14-23-20/h2-6,11-12,14H,7-10,13H2,1H3,(H,25,28)(H,26,31)(H,23,24,27)
n/an/a 5.90n/an/an/an/an/an/a
China Pharmaceutical University
Curated by ChEMBL
Assay Description
Inhibition of human CDK2/Cyclin A1 using histone H1 as substrate preincubated for 20 mins followed by [gamma-33P]-ATP addition measure after 120 mins...
J Med Chem 61: 1499-1518 (2018)
Article DOI: 10.1021/acs.jmedchem.7b01261
BindingDB Entry DOI: 10.7270/Q2FR003K
Receptor-type tyrosine-protein kinase FLT3
(Homo sapiens (Human))
BDBM50270298
(CHEMBL4075720)
Show SMILES CN1CCN(Cc2ccc(NC(=O)c3n[nH]cc3Nc3ncnc4sccc34)cc2)CC1
Show InChI InChI=1S/C22H24N8OS/c1-29-7-9-30(10-8-29)13-15-2-4-16(5-3-15)26-21(31)19-18(12-25-28-19)27-20-17-6-11-32-22(17)24-14-23-20/h2-6,11-12,14H,7-10,13H2,1H3,(H,25,28)(H,26,31)(H,23,24,27)
n/an/a 0.438n/an/an/an/an/an/a
China Pharmaceutical University
Curated by ChEMBL
Assay Description
Inhibition of human FLT3 using EAIYAAPFAKKK as substrate preincubated for 20 mins followed by [gamma-33P]-ATP addition measure after 120 mins by filt...
J Med Chem 61: 1499-1518 (2018)
Article DOI: 10.1021/acs.jmedchem.7b01261
BindingDB Entry DOI: 10.7270/Q2FR003K
Cyclin-K
(Homo sapiens (Human))
BDBM50270298
(CHEMBL4075720)
Show SMILES CN1CCN(Cc2ccc(NC(=O)c3n[nH]cc3Nc3ncnc4sccc34)cc2)CC1
Show InChI InChI=1S/C22H24N8OS/c1-29-7-9-30(10-8-29)13-15-2-4-16(5-3-15)26-21(31)19-18(12-25-28-19)27-20-17-6-11-32-22(17)24-14-23-20/h2-6,11-12,14H,7-10,13H2,1H3,(H,25,28)(H,26,31)(H,23,24,27)
n/an/a 39n/an/an/an/an/an/a
China Pharmaceutical University
Curated by ChEMBL
Assay Description
Inhibition of human CDK9/Cyclin K using KTFCGTPEYLAPEVRREPRILSEEEQEMFRDFDYIADWC as substrate preincubated for 20 mins followed by [gamma-33P]-ATP add...
J Med Chem 61: 1499-1518 (2018)
Article DOI: 10.1021/acs.jmedchem.7b01261
BindingDB Entry DOI: 10.7270/Q2FR003K
Cyclin-dependent kinase/G1/S-specific cyclin- 1
(Homo sapiens (Human))
BDBM50270298
(CHEMBL4075720)
Show SMILES CN1CCN(Cc2ccc(NC(=O)c3n[nH]cc3Nc3ncnc4sccc34)cc2)CC1
Show InChI InChI=1S/C22H24N8OS/c1-29-7-9-30(10-8-29)13-15-2-4-16(5-3-15)26-21(31)19-18(12-25-28-19)27-20-17-6-11-32-22(17)24-14-23-20/h2-6,11-12,14H,7-10,13H2,1H3,(H,25,28)(H,26,31)(H,23,24,27)
Reactome pathway
n/an/a 96n/an/an/an/an/an/a
China Pharmaceutical University
Curated by ChEMBL
Assay Description
Inhibition of human CDK1/Cyclin E using RB protein as substrate preincubated for 20 mins followed by [gamma-33P]-ATP addition measure after 120 mins ...
J Med Chem 61: 1499-1518 (2018)
Article DOI: 10.1021/acs.jmedchem.7b01261
BindingDB Entry DOI: 10.7270/Q2FR003K
Receptor-type tyrosine-protein kinase FLT3
(Homo sapiens (Human))
BDBM50270298
(CHEMBL4075720)
Show SMILES CN1CCN(Cc2ccc(NC(=O)c3n[nH]cc3Nc3ncnc4sccc34)cc2)CC1
Show InChI InChI=1S/C22H24N8OS/c1-29-7-9-30(10-8-29)13-15-2-4-16(5-3-15)26-21(31)19-18(12-25-28-19)27-20-17-6-11-32-22(17)24-14-23-20/h2-6,11-12,14H,7-10,13H2,1H3,(H,25,28)(H,26,31)(H,23,24,27)
n/an/a 13n/an/an/an/an/an/a
China Pharmaceutical University
Curated by ChEMBL
Assay Description
Inhibition of human FLT3 Y591-V592 mutant by Hotspot assay
Eur J Med Chem 155: 303-315 (2018)
Article DOI: 10.1016/j.ejmech.2018.06.010
BindingDB Entry DOI: 10.7270/Q2668GSP
Receptor-type tyrosine-protein kinase FLT3
(Homo sapiens (Human))
BDBM50270298
(CHEMBL4075720)
Show SMILES CN1CCN(Cc2ccc(NC(=O)c3n[nH]cc3Nc3ncnc4sccc34)cc2)CC1
Show InChI InChI=1S/C22H24N8OS/c1-29-7-9-30(10-8-29)13-15-2-4-16(5-3-15)26-21(31)19-18(12-25-28-19)27-20-17-6-11-32-22(17)24-14-23-20/h2-6,11-12,14H,7-10,13H2,1H3,(H,25,28)(H,26,31)(H,23,24,27)
n/an/an/a 7n/an/an/an/an/a
China Pharmaceutical University
Curated by ChEMBL
Assay Description
Binding affinity to human FLT3 D835Y mutant (Q580 to Y969 residues) expressed in bacterial expression system by Kinomescan method
Eur J Med Chem 155: 303-315 (2018)
Article DOI: 10.1016/j.ejmech.2018.06.010
BindingDB Entry DOI: 10.7270/Q2668GSP
Receptor-type tyrosine-protein kinase FLT3
(Homo sapiens (Human))
BDBM50270298
(CHEMBL4075720)
Show SMILES CN1CCN(Cc2ccc(NC(=O)c3n[nH]cc3Nc3ncnc4sccc34)cc2)CC1
Show InChI InChI=1S/C22H24N8OS/c1-29-7-9-30(10-8-29)13-15-2-4-16(5-3-15)26-21(31)19-18(12-25-28-19)27-20-17-6-11-32-22(17)24-14-23-20/h2-6,11-12,14H,7-10,13H2,1H3,(H,25,28)(H,26,31)(H,23,24,27)
n/an/an/a 1.30n/an/an/an/an/a
China Pharmaceutical University
Curated by ChEMBL
Assay Description
Binding affinity to human FLT3 ITD/F691L double mutant expressed in bacterial expression system by Kinomescan method
Eur J Med Chem 155: 303-315 (2018)
Article DOI: 10.1016/j.ejmech.2018.06.010
BindingDB Entry DOI: 10.7270/Q2668GSP
Cyclin-dependent kinase 4/G1/S-specific cyclin-D1
(Homo sapiens (Human))
BDBM50270298
(CHEMBL4075720)
Show SMILES CN1CCN(Cc2ccc(NC(=O)c3n[nH]cc3Nc3ncnc4sccc34)cc2)CC1
Show InChI InChI=1S/C22H24N8OS/c1-29-7-9-30(10-8-29)13-15-2-4-16(5-3-15)26-21(31)19-18(12-25-28-19)27-20-17-6-11-32-22(17)24-14-23-20/h2-6,11-12,14H,7-10,13H2,1H3,(H,25,28)(H,26,31)(H,23,24,27)
NCI pathway
Reactome pathway
n/an/a<10n/an/an/an/an/an/a
China Pharmaceutical University
Curated by ChEMBL
Assay Description
Inhibition of human CDK4/Cyclin-D1 at 0.123 uM by Hotspot assay
Eur J Med Chem 155: 303-315 (2018)
Article DOI: 10.1016/j.ejmech.2018.06.010
BindingDB Entry DOI: 10.7270/Q2668GSP
Receptor-type tyrosine-protein kinase FLT3
(Homo sapiens (Human))
BDBM50270298
(CHEMBL4075720)
Show SMILES CN1CCN(Cc2ccc(NC(=O)c3n[nH]cc3Nc3ncnc4sccc34)cc2)CC1
Show InChI InChI=1S/C22H24N8OS/c1-29-7-9-30(10-8-29)13-15-2-4-16(5-3-15)26-21(31)19-18(12-25-28-19)27-20-17-6-11-32-22(17)24-14-23-20/h2-6,11-12,14H,7-10,13H2,1H3,(H,25,28)(H,26,31)(H,23,24,27)
n/an/a 0.540n/an/an/an/an/an/a
China Pharmaceutical University
Curated by ChEMBL
Assay Description
Inhibition of human FLT3 D835Y mutant by Hotspot assay
Eur J Med Chem 155: 303-315 (2018)
Article DOI: 10.1016/j.ejmech.2018.06.010
BindingDB Entry DOI: 10.7270/Q2668GSP
Receptor-type tyrosine-protein kinase FLT3
(Homo sapiens (Human))
BDBM50270298
(CHEMBL4075720)
Show SMILES CN1CCN(Cc2ccc(NC(=O)c3n[nH]cc3Nc3ncnc4sccc34)cc2)CC1
Show InChI InChI=1S/C22H24N8OS/c1-29-7-9-30(10-8-29)13-15-2-4-16(5-3-15)26-21(31)19-18(12-25-28-19)27-20-17-6-11-32-22(17)24-14-23-20/h2-6,11-12,14H,7-10,13H2,1H3,(H,25,28)(H,26,31)(H,23,24,27)
n/an/a 0.600n/an/an/an/an/an/a
China Pharmaceutical University
Curated by ChEMBL
Assay Description
Inhibition of human FLT3 by Hotspot assay
Eur J Med Chem 155: 303-315 (2018)
Article DOI: 10.1016/j.ejmech.2018.06.010
BindingDB Entry DOI: 10.7270/Q2668GSP
Vascular endothelial growth factor receptor 1
(Homo sapiens (Human))
BDBM50270298
(CHEMBL4075720)
Show SMILES CN1CCN(Cc2ccc(NC(=O)c3n[nH]cc3Nc3ncnc4sccc34)cc2)CC1
Show InChI InChI=1S/C22H24N8OS/c1-29-7-9-30(10-8-29)13-15-2-4-16(5-3-15)26-21(31)19-18(12-25-28-19)27-20-17-6-11-32-22(17)24-14-23-20/h2-6,11-12,14H,7-10,13H2,1H3,(H,25,28)(H,26,31)(H,23,24,27)
n/an/a 20n/an/an/an/an/an/a
China Pharmaceutical University
Curated by ChEMBL
Assay Description
Inhibition of human FLT1 by Hotspot assay
Eur J Med Chem 155: 303-315 (2018)
Article DOI: 10.1016/j.ejmech.2018.06.010
BindingDB Entry DOI: 10.7270/Q2668GSP
Vascular endothelial growth factor receptor 2
(Homo sapiens (Human))
BDBM50270298
(CHEMBL4075720)
Show SMILES CN1CCN(Cc2ccc(NC(=O)c3n[nH]cc3Nc3ncnc4sccc34)cc2)CC1
Show InChI InChI=1S/C22H24N8OS/c1-29-7-9-30(10-8-29)13-15-2-4-16(5-3-15)26-21(31)19-18(12-25-28-19)27-20-17-6-11-32-22(17)24-14-23-20/h2-6,11-12,14H,7-10,13H2,1H3,(H,25,28)(H,26,31)(H,23,24,27)
NCI pathway
Reactome pathway
n/an/a 35n/an/an/an/an/an/a
China Pharmaceutical University
Curated by ChEMBL
Assay Description
Inhibition of human KDR by Hotspot assay
Eur J Med Chem 155: 303-315 (2018)
Article DOI: 10.1016/j.ejmech.2018.06.010
BindingDB Entry DOI: 10.7270/Q2668GSP
Vascular endothelial growth factor receptor 3
(Homo sapiens (Human))
BDBM50270298
(CHEMBL4075720)
Show SMILES CN1CCN(Cc2ccc(NC(=O)c3n[nH]cc3Nc3ncnc4sccc34)cc2)CC1
Show InChI InChI=1S/C22H24N8OS/c1-29-7-9-30(10-8-29)13-15-2-4-16(5-3-15)26-21(31)19-18(12-25-28-19)27-20-17-6-11-32-22(17)24-14-23-20/h2-6,11-12,14H,7-10,13H2,1H3,(H,25,28)(H,26,31)(H,23,24,27)
n/an/a 4.5n/an/an/an/an/an/a
China Pharmaceutical University
Curated by ChEMBL
Assay Description
Inhibition of human FLT4 by Hotspot assay
Eur J Med Chem 155: 303-315 (2018)
Article DOI: 10.1016/j.ejmech.2018.06.010
BindingDB Entry DOI: 10.7270/Q2668GSP
Cyclin-A2/Cyclin-dependent kinase 2
(Homo sapiens (Human))
BDBM50270298
(CHEMBL4075720)
Show SMILES CN1CCN(Cc2ccc(NC(=O)c3n[nH]cc3Nc3ncnc4sccc34)cc2)CC1
Show InChI InChI=1S/C22H24N8OS/c1-29-7-9-30(10-8-29)13-15-2-4-16(5-3-15)26-21(31)19-18(12-25-28-19)27-20-17-6-11-32-22(17)24-14-23-20/h2-6,11-12,14H,7-10,13H2,1H3,(H,25,28)(H,26,31)(H,23,24,27)
NCI pathway
Reactome pathway
n/an/a<10n/an/an/an/an/an/a
China Pharmaceutical University
Curated by ChEMBL
Assay Description
Inhibition of human CDK2/Cyclin-A at 0.123 uM by Hotspot assay
Eur J Med Chem 155: 303-315 (2018)
Article DOI: 10.1016/j.ejmech.2018.06.010
BindingDB Entry DOI: 10.7270/Q2668GSP
Cyclin-dependent kinase 6/G1/S-specific cyclin-D1
(Homo sapiens (Human))
BDBM50270298
(CHEMBL4075720)
Show SMILES CN1CCN(Cc2ccc(NC(=O)c3n[nH]cc3Nc3ncnc4sccc34)cc2)CC1
Show InChI InChI=1S/C22H24N8OS/c1-29-7-9-30(10-8-29)13-15-2-4-16(5-3-15)26-21(31)19-18(12-25-28-19)27-20-17-6-11-32-22(17)24-14-23-20/h2-6,11-12,14H,7-10,13H2,1H3,(H,25,28)(H,26,31)(H,23,24,27)
n/an/a<10n/an/an/an/an/an/a
China Pharmaceutical University
Curated by ChEMBL
Assay Description
Inhibition of human CDK6/Cyclin-D1 at 0.123 uM by Hotspot assay
Eur J Med Chem 155: 303-315 (2018)
Article DOI: 10.1016/j.ejmech.2018.06.010
BindingDB Entry DOI: 10.7270/Q2668GSP
Mitogen-activated protein kinase 15
(Homo sapiens (Human))
BDBM50270298
(CHEMBL4075720)
Show SMILES CN1CCN(Cc2ccc(NC(=O)c3n[nH]cc3Nc3ncnc4sccc34)cc2)CC1
Show InChI InChI=1S/C22H24N8OS/c1-29-7-9-30(10-8-29)13-15-2-4-16(5-3-15)26-21(31)19-18(12-25-28-19)27-20-17-6-11-32-22(17)24-14-23-20/h2-6,11-12,14H,7-10,13H2,1H3,(H,25,28)(H,26,31)(H,23,24,27)
n/an/a<10n/an/an/an/an/an/a
China Pharmaceutical University
Curated by ChEMBL
Assay Description
Inhibition of human ERK7 at 0.123 uM by Hotspot assay
Eur J Med Chem 155: 303-315 (2018)
Article DOI: 10.1016/j.ejmech.2018.06.010
BindingDB Entry DOI: 10.7270/Q2668GSP
Receptor-type tyrosine-protein kinase FLT3
(Homo sapiens (Human))
BDBM50270298
(CHEMBL4075720)
Show SMILES CN1CCN(Cc2ccc(NC(=O)c3n[nH]cc3Nc3ncnc4sccc34)cc2)CC1
Show InChI InChI=1S/C22H24N8OS/c1-29-7-9-30(10-8-29)13-15-2-4-16(5-3-15)26-21(31)19-18(12-25-28-19)27-20-17-6-11-32-22(17)24-14-23-20/h2-6,11-12,14H,7-10,13H2,1H3,(H,25,28)(H,26,31)(H,23,24,27)
n/an/a 1.20n/an/an/an/an/an/a
China Pharmaceutical University
Curated by ChEMBL
Assay Description
Inhibition of human FLT3 F594_R595insR mutant by Hotspot assay
Eur J Med Chem 155: 303-315 (2018)
Article DOI: 10.1016/j.ejmech.2018.06.010
BindingDB Entry DOI: 10.7270/Q2668GSP
Cyclin-dependent kinase 2
(Homo sapiens (Human))
BDBM50270298
(CHEMBL4075720)
Show SMILES CN1CCN(Cc2ccc(NC(=O)c3n[nH]cc3Nc3ncnc4sccc34)cc2)CC1
Show InChI InChI=1S/C22H24N8OS/c1-29-7-9-30(10-8-29)13-15-2-4-16(5-3-15)26-21(31)19-18(12-25-28-19)27-20-17-6-11-32-22(17)24-14-23-20/h2-6,11-12,14H,7-10,13H2,1H3,(H,25,28)(H,26,31)(H,23,24,27)
NCI pathway
Reactome pathway
n/an/a 9.10n/an/an/an/an/an/a
China Pharmaceutical University
Curated by ChEMBL
Assay Description
Inhibition of CDK2 (unknown origin) by Hotspot assay
Eur J Med Chem 155: 303-315 (2018)
Article DOI: 10.1016/j.ejmech.2018.06.010
BindingDB Entry DOI: 10.7270/Q2668GSP
Cyclin-dependent kinase 6
(Homo sapiens (Human))
BDBM50270298
(CHEMBL4075720)
Show SMILES CN1CCN(Cc2ccc(NC(=O)c3n[nH]cc3Nc3ncnc4sccc34)cc2)CC1
Show InChI InChI=1S/C22H24N8OS/c1-29-7-9-30(10-8-29)13-15-2-4-16(5-3-15)26-21(31)19-18(12-25-28-19)27-20-17-6-11-32-22(17)24-14-23-20/h2-6,11-12,14H,7-10,13H2,1H3,(H,25,28)(H,26,31)(H,23,24,27)
NCI pathway
Reactome pathway
n/an/a 3.30n/an/an/an/an/an/a
China Pharmaceutical University
Curated by ChEMBL
Assay Description
Inhibition of CDK6 (unknown origin) by Hotspot assay
Eur J Med Chem 155: 303-315 (2018)
Article DOI: 10.1016/j.ejmech.2018.06.010
BindingDB Entry DOI: 10.7270/Q2668GSP
Receptor-type tyrosine-protein kinase FLT3
(Homo sapiens (Human))
BDBM50270298
(CHEMBL4075720)
Show SMILES CN1CCN(Cc2ccc(NC(=O)c3n[nH]cc3Nc3ncnc4sccc34)cc2)CC1
Show InChI InChI=1S/C22H24N8OS/c1-29-7-9-30(10-8-29)13-15-2-4-16(5-3-15)26-21(31)19-18(12-25-28-19)27-20-17-6-11-32-22(17)24-14-23-20/h2-6,11-12,14H,7-10,13H2,1H3,(H,25,28)(H,26,31)(H,23,24,27)
n/an/a 7.40n/an/an/an/an/an/a
China Pharmaceutical University
Curated by ChEMBL
Assay Description
Inhibition of human FLT3 F594_R595insREY mutant by Hotspot assay
Eur J Med Chem 155: 303-315 (2018)
Article DOI: 10.1016/j.ejmech.2018.06.010
BindingDB Entry DOI: 10.7270/Q2668GSP
Receptor-type tyrosine-protein kinase FLT3
(Homo sapiens (Human))
BDBM50270298
(CHEMBL4075720)
Show SMILES CN1CCN(Cc2ccc(NC(=O)c3n[nH]cc3Nc3ncnc4sccc34)cc2)CC1
Show InChI InChI=1S/C22H24N8OS/c1-29-7-9-30(10-8-29)13-15-2-4-16(5-3-15)26-21(31)19-18(12-25-28-19)27-20-17-6-11-32-22(17)24-14-23-20/h2-6,11-12,14H,7-10,13H2,1H3,(H,25,28)(H,26,31)(H,23,24,27)
n/an/a 18n/an/an/an/an/an/a
China Pharmaceutical University
Curated by ChEMBL
Assay Description
Inhibition of human FLT3 ITD-NPOS mutant by Hotspot assay
Eur J Med Chem 155: 303-315 (2018)
Article DOI: 10.1016/j.ejmech.2018.06.010
BindingDB Entry DOI: 10.7270/Q2668GSP
Receptor-type tyrosine-protein kinase FLT3
(Homo sapiens (Human))
BDBM50270298
(CHEMBL4075720)
Show SMILES CN1CCN(Cc2ccc(NC(=O)c3n[nH]cc3Nc3ncnc4sccc34)cc2)CC1
Show InChI InChI=1S/C22H24N8OS/c1-29-7-9-30(10-8-29)13-15-2-4-16(5-3-15)26-21(31)19-18(12-25-28-19)27-20-17-6-11-32-22(17)24-14-23-20/h2-6,11-12,14H,7-10,13H2,1H3,(H,25,28)(H,26,31)(H,23,24,27)
n/an/a 1.90n/an/an/an/an/an/a
China Pharmaceutical University
Curated by ChEMBL
Assay Description
Inhibition of human FLT3 ITD-W51 mutant by Hotspot assay
Eur J Med Chem 155: 303-315 (2018)
Article DOI: 10.1016/j.ejmech.2018.06.010
BindingDB Entry DOI: 10.7270/Q2668GSP
Receptor-type tyrosine-protein kinase FLT3
(Homo sapiens (Human))
BDBM50270298
(CHEMBL4075720)
Show SMILES CN1CCN(Cc2ccc(NC(=O)c3n[nH]cc3Nc3ncnc4sccc34)cc2)CC1
Show InChI InChI=1S/C22H24N8OS/c1-29-7-9-30(10-8-29)13-15-2-4-16(5-3-15)26-21(31)19-18(12-25-28-19)27-20-17-6-11-32-22(17)24-14-23-20/h2-6,11-12,14H,7-10,13H2,1H3,(H,25,28)(H,26,31)(H,23,24,27)
n/an/a 2.70n/an/an/an/an/an/a
China Pharmaceutical University
Curated by ChEMBL
Assay Description
Inhibition of human FLT3 R595_E596 mutant by Hotspot assay
Eur J Med Chem 155: 303-315 (2018)
Article DOI: 10.1016/j.ejmech.2018.06.010
BindingDB Entry DOI: 10.7270/Q2668GSP
Vascular endothelial growth factor receptor 2
(Homo sapiens (Human))
BDBM50270298
(CHEMBL4075720)
Show SMILES CN1CCN(Cc2ccc(NC(=O)c3n[nH]cc3Nc3ncnc4sccc34)cc2)CC1
Show InChI InChI=1S/C22H24N8OS/c1-29-7-9-30(10-8-29)13-15-2-4-16(5-3-15)26-21(31)19-18(12-25-28-19)27-20-17-6-11-32-22(17)24-14-23-20/h2-6,11-12,14H,7-10,13H2,1H3,(H,25,28)(H,26,31)(H,23,24,27)
NCI pathway
Reactome pathway
n/an/a 35n/an/an/an/an/an/a
China Pharmaceutical University
Curated by ChEMBL
Assay Description
Inhibition of human KDR using poly[Glu:Tyr] (4:1) as substrate preincubated for 20 mins followed by [gamma-33P]-ATP addition measure after 120 mins b...
J Med Chem 61: 1499-1518 (2018)
Article DOI: 10.1021/acs.jmedchem.7b01261
BindingDB Entry DOI: 10.7270/Q2FR003K