BDBM50270780 CHEMBL4125903
SMILES: Cl.NC(=N)Nc1nc2CCCCc2s1
InChI Key: InChIKey=CKBIOORETGHJLB-UHFFFAOYSA-N
Data: 1 KI  1 EC50
Activity Spreadsheet -- Enzyme Inhibition Constant Data from BindingDB
Found 2 hits for monomerid = 50270780
Trg + Lig
Ki
nM
ΔG°
kcal/mole
IC50
nM
Kd
nM
EC50/IC50
nM
koff
s-1
kon
M-1s-1
pHTemp
°C
Adrenergic receptor alpha-2
(Homo sapiens (Human))
BDBM50270780
(CHEMBL4125903)
Show SMILES Cl.NC(=N)Nc1nc2CCCCc2s1
Show InChI InChI=1S/C8H12N4S/c9-7(10)12-8-11-5-3-1-2-4-6(5)13-8/h1-4H2,(H4,9,10,11,12)
1.21E+3n/an/an/an/an/an/an/an/a
Trinity College
Curated by ChEMBL
Assay Description
Displacement of [3H]RX821002 from alpha2 adrenergic receptor in human brain prefrontal cortex membranes after 30 mins by microbeta liquid scintillati...
Eur J Med Chem 138: 38-50 (2017)
Article DOI: 10.1016/j.ejmech.2017.06.008
BindingDB Entry DOI: 10.7270/Q2BV7K3C
Adrenergic receptor alpha-2
(Homo sapiens (Human))
BDBM50270780
(CHEMBL4125903)
Show SMILES Cl.NC(=N)Nc1nc2CCCCc2s1
Show InChI InChI=1S/C8H12N4S/c9-7(10)12-8-11-5-3-1-2-4-6(5)13-8/h1-4H2,(H4,9,10,11,12)
n/an/an/an/a 1.14E+4n/an/an/an/a
Trinity College
Curated by ChEMBL
Assay Description
Activity at alpha2 adrenergic receptor in human brain prefrontal cortex membranes assessed as effect on UK14304-induced [35S]GTPgammaS binding by mea...
Eur J Med Chem 138: 38-50 (2017)
Article DOI: 10.1016/j.ejmech.2017.06.008
BindingDB Entry DOI: 10.7270/Q2BV7K3C