null
SMILES: OC(c1ccccc1)c1ccc(CCNS(=O)(=O)c2ccc(cc2)C#N)cc1
InChI Key: InChIKey=SEEKXMUMAGSBBK-UHFFFAOYSA-N
Activity Spreadsheet -- Enzyme Inhibition Constant Data from BindingDB
Found 1 hit for monomerid = 50271528
Trg + Lig
Ki
nM
ΔG°
kcal/mole
IC50
nM
Kd
nM
EC50/IC50
nM
koff
s-1
kon
M-1s-1
pHTemp
°C
Lanosterol synthase
(Homo sapiens (Human))
BDBM50271528
(CHEMBL483117 | rac-N-(4-(hydroxy(phenyl)methyl)phe...)
Show SMILES OC(c1ccccc1)c1ccc(CCNS(=O)(=O)c2ccc(cc2)C#N)cc1
Show InChI InChI=1S/C22H20N2O3S/c23-16-18-8-12-21(13-9-18)28(26,27)24-15-14-17-6-10-20(11-7-17)22(25)19-4-2-1-3-5-19/h1-13,22,24-25H,14-15H2
Reactome pathway
n/an/an/an/a 100n/an/an/an/a
Laboratoire GlaxoSmithKline
Curated by ChEMBL
Assay Description
Inhibition of 2,3-oxidosqualene-lanosterol cyclase (unknown origin)
Bioorg Med Chem 16: 6218-32 (2008)
Article DOI: 10.1016/j.bmc.2008.04.034
BindingDB Entry DOI: 10.7270/Q2M61K14