BDBM50271549 1-(4-(3-bromophenoxy)butyl)-1H-imidazole::CHEMBL482686
SMILES: Brc1cccc(OCCCCn2ccnc2)c1
InChI Key: InChIKey=QWYZAVYFCGPMDM-UHFFFAOYSA-N
Data: 1 KI  5 IC50
Activity Spreadsheet -- Enzyme Inhibition Constant Data from BindingDB
Found 6 hits for monomerid = 50271549
Trg + Lig
Ki
nM
ΔG°
kcal/mole
IC50
nM
Kd
nM
EC50/IC50
nM
koff
s-1
kon
M-1s-1
pHTemp
°C
Nitric oxide synthase, brain
(Homo sapiens (Human))
BDBM50271549
(1-(4-(3-bromophenoxy)butyl)-1H-imidazole | CHEMBL4...)
Show SMILES Brc1cccc(OCCCCn2ccnc2)c1
Show InChI InChI=1S/C13H15BrN2O/c14-12-4-3-5-13(10-12)17-9-2-1-7-16-8-6-15-11-16/h3-6,8,10-11H,1-2,7,9H2
Reactome pathway
6.00E+4n/an/an/an/an/an/an/an/a
Instituto de Química Médica
Curated by ChEMBL
Assay Description
Inhibition of nNOS (unknown origin) assessed as conversion of L-[3H]arginine to L-[3H]citrulline
Bioorg Med Chem 16: 6193-206 (2008)
Article DOI: 10.1016/j.bmc.2008.04.036
BindingDB Entry DOI: 10.7270/Q2611040
Heme Oxygenase 1 (HO-1)
(Rattus norvegicus (rat))
BDBM50271549
(1-(4-(3-bromophenoxy)butyl)-1H-imidazole | CHEMBL4...)
Show SMILES Brc1cccc(OCCCCn2ccnc2)c1
Show InChI InChI=1S/C13H15BrN2O/c14-12-4-3-5-13(10-12)17-9-2-1-7-16-8-6-15-11-16/h3-6,8,10-11H,1-2,7,9H2
Reactome pathway
n/an/a 2.10E+3n/an/an/an/an/an/a
University of Catania
Curated by ChEMBL
Assay Description
Inhibition of Sprague-Dawley rat spleen microsomal HO-1 assessed as bilirubin formation after 60 mins by spectrophotometric analysis
Bioorg Med Chem 21: 5145-53 (2013)
Article DOI: 10.1016/j.bmc.2013.06.040
BindingDB Entry DOI: 10.7270/Q2FF3TSH
Heme oxygenase 1
(Rattus norvegicus (rat))
BDBM50271549
(1-(4-(3-bromophenoxy)butyl)-1H-imidazole | CHEMBL4...)
Show SMILES Brc1cccc(OCCCCn2ccnc2)c1
Show InChI InChI=1S/C13H15BrN2O/c14-12-4-3-5-13(10-12)17-9-2-1-7-16-8-6-15-11-16/h3-6,8,10-11H,1-2,7,9H2
Reactome pathway
n/an/a 2.10E+3n/an/an/an/an/an/a
University of Catania
Curated by ChEMBL
Assay Description
Inhibition of HO-1 in Sprague-Dawley rat spleen microsomes using NADPH as substrate incubated for 60 mins by spectrometry based assay
Eur J Med Chem 167: 439-453 (2019)
Article DOI: 10.1016/j.ejmech.2019.02.027
Heme oxygenase 1
(Rattus norvegicus (rat))
BDBM50271549
(1-(4-(3-bromophenoxy)butyl)-1H-imidazole | CHEMBL4...)
Show SMILES Brc1cccc(OCCCCn2ccnc2)c1
Show InChI InChI=1S/C13H15BrN2O/c14-12-4-3-5-13(10-12)17-9-2-1-7-16-8-6-15-11-16/h3-6,8,10-11H,1-2,7,9H2
Reactome pathway
n/an/a 2.10E+3n/an/an/an/an/an/a
University of Catania
Curated by ChEMBL
Assay Description
Inhibition of heme oxygenase 1 in Sprague-Dawley rat spleen microsomal fraction assessed as decrease in bilirubin formation using biliverdin reductas...
Eur J Med Chem 158: 937-950 (2018)
Article DOI: 10.1016/j.ejmech.2018.09.048
BindingDB Entry DOI: 10.7270/Q2NK3HQ4
Heme oxygenase 2
(Homo sapiens)
BDBM50271549
(1-(4-(3-bromophenoxy)butyl)-1H-imidazole | CHEMBL4...)
Show SMILES Brc1cccc(OCCCCn2ccnc2)c1
Show InChI InChI=1S/C13H15BrN2O/c14-12-4-3-5-13(10-12)17-9-2-1-7-16-8-6-15-11-16/h3-6,8,10-11H,1-2,7,9H2
n/an/a 2.20E+3n/an/an/an/an/an/a
University of Catania
Curated by ChEMBL
Assay Description
Inhibition of HO-2 (unknown origin)
Eur J Med Chem 167: 439-453 (2019)
Article DOI: 10.1016/j.ejmech.2019.02.027
Heme Oxygenase 2 (HO-2)
(Rattus norvegicus (rat))
BDBM50271549
(1-(4-(3-bromophenoxy)butyl)-1H-imidazole | CHEMBL4...)
Show SMILES Brc1cccc(OCCCCn2ccnc2)c1
Show InChI InChI=1S/C13H15BrN2O/c14-12-4-3-5-13(10-12)17-9-2-1-7-16-8-6-15-11-16/h3-6,8,10-11H,1-2,7,9H2
Reactome pathway
n/an/a 2.20E+3n/an/an/an/an/an/a
University of Catania
Curated by ChEMBL
Assay Description
Inhibition of Sprague-Dawley rat brain HO-2 assessed as bilirubin formation after 60 mins by spectrophotometric analysis
Bioorg Med Chem 21: 5145-53 (2013)
Article DOI: 10.1016/j.bmc.2013.06.040
BindingDB Entry DOI: 10.7270/Q2FF3TSH