BDBM50271992 (2R,5R)-5-cyclohexyl-1-(3-cyclohexylpropyl)-2-[(4-methoxyphenyl)methyl]-1H,2H,3H,5H,6H-imidazo[1,2-a]imidazolidin-7-ium
SMILES: COc1ccc(CC2C[N+]3=C(NCC3C3CCCCC3)N2CCCC2CCCCC2)cc1
InChI Key: InChIKey=UMIJHKIIVRNJCH-UHFFFAOYSA-O
Data: 3 IC50
Activity Spreadsheet -- Enzyme Inhibition Constant Data from BindingDB
Found 3 hits for monomerid = 50271992
Trg + Lig
Ki
nM
ΔG°
kcal/mole
IC50
nM
Kd
nM
EC50/IC50
nM
koff
s-1
kon
M-1s-1
pHTemp
°C
Kappa-type opioid receptor
(Homo sapiens (Human))
BDBM50271992
((2R,5R)-5-cyclohexyl-1-(3-cyclohexylpropyl)-2-[(4-...)
Show SMILES COc1ccc(CC2C[N+]3=C(NCC3C3CCCCC3)N2CCCC2CCCCC2)cc1 |t:9|
Show InChI InChI=1S/C28H43N3O/c1-32-26-16-14-23(15-17-26)19-25-21-31-27(24-12-6-3-7-13-24)20-29-28(31)30(25)18-8-11-22-9-4-2-5-10-22/h14-17,22,24-25,27H,2-13,18-21H2,1H3/p+1
Reactome pathway
n/an/a 2.62E+3n/an/an/an/an/an/a
Torrey Pines Institute for Molecular Studies
Curated by ChEMBL
Assay Description
Inhibition of Opioid receptor kappa 1 binding
J Med Chem 42: 3743-78 (1999)
BindingDB Entry DOI: 10.7270/Q22Z167W
Kappa-type opioid receptor
(Cavia porcellus (domestic guinea pig))
BDBM50271992
((2R,5R)-5-cyclohexyl-1-(3-cyclohexylpropyl)-2-[(4-...)
Show SMILES COc1ccc(CC2C[N+]3=C(NCC3C3CCCCC3)N2CCCC2CCCCC2)cc1 |t:9|
Show InChI InChI=1S/C28H43N3O/c1-32-26-16-14-23(15-17-26)19-25-21-31-27(24-12-6-3-7-13-24)20-29-28(31)30(25)18-8-11-22-9-4-2-5-10-22/h14-17,22,24-25,27H,2-13,18-21H2,1H3/p+1
n/an/a 547n/an/an/an/an/an/a
Torrey Pines Institute for Molecular Studies
Curated by ChEMBL
Assay Description
Displacement of [3H]U69593 from kappa opioid receptor in guinea pig brain homogenate
Bioorg Med Chem 16: 5932-8 (2008)
Article DOI: 10.1016/j.bmc.2008.04.061
BindingDB Entry DOI: 10.7270/Q2BG2PW7
Kappa-type opioid receptor
(Homo sapiens (Human))
BDBM50271992
((2R,5R)-5-cyclohexyl-1-(3-cyclohexylpropyl)-2-[(4-...)
Show SMILES COc1ccc(CC2C[N+]3=C(NCC3C3CCCCC3)N2CCCC2CCCCC2)cc1 |t:9|
Show InChI InChI=1S/C28H43N3O/c1-32-26-16-14-23(15-17-26)19-25-21-31-27(24-12-6-3-7-13-24)20-29-28(31)30(25)18-8-11-22-9-4-2-5-10-22/h14-17,22,24-25,27H,2-13,18-21H2,1H3/p+1
Reactome pathway
n/an/a 547n/an/an/an/an/an/a
Torrey Pines Institute for Molecular Studies
Curated by ChEMBL
Assay Description
Inhibitory activity for kappa opioid receptor
J Med Chem 42: 3743-78 (1999)
BindingDB Entry DOI: 10.7270/Q22Z167W