BDBM50272095 4-(3-(4-methoxyphenyl)-1H-indol-2-yl)benzenesulfonamide::CHEMBL499068
SMILES: COc1ccc(cc1)-c1c([nH]c2ccccc12)-c1ccc(cc1)S(N)(=O)=O
InChI Key: InChIKey=XUIMZWHJUVXRFX-UHFFFAOYSA-N
Data: 3 IC50
Activity Spreadsheet -- Enzyme Inhibition Constant Data from BindingDB
Found 3 hits for monomerid = 50272095
Trg + Lig
Ki
nM
ΔG°
kcal/mole
IC50
nM
Kd
nM
EC50/IC50
nM
koff
s-1
kon
M-1s-1
pHTemp
°C
Cyclooxygenase
(Homo sapiens (Human))
BDBM50272095
(4-(3-(4-methoxyphenyl)-1H-indol-2-yl)benzenesulfon...)
Show SMILES COc1ccc(cc1)-c1c([nH]c2ccccc12)-c1ccc(cc1)S(N)(=O)=O
Show InChI InChI=1S/C21H18N2O3S/c1-26-16-10-6-14(7-11-16)20-18-4-2-3-5-19(18)23-21(20)15-8-12-17(13-9-15)27(22,24)25/h2-13,23H,1H3,(H2,22,24,25)
NCI pathway
Reactome pathway
n/an/a 0.00600n/an/an/an/an/an/a
Institute of Technology and Science
Curated by ChEMBL
Assay Description
Inhibition of COX2 (unknown origin)
Eur J Med Chem 43: 1297-303 (2008)
Article DOI: 10.1016/j.ejmech.2007.06.022
BindingDB Entry DOI: 10.7270/Q2CC10F1
Prostaglandin G/H synthase (cyclooxygenase)
(Mus musculus (Mouse))
BDBM50272095
(4-(3-(4-methoxyphenyl)-1H-indol-2-yl)benzenesulfon...)
Show SMILES COc1ccc(cc1)-c1c([nH]c2ccccc12)-c1ccc(cc1)S(N)(=O)=O
Show InChI InChI=1S/C21H18N2O3S/c1-26-16-10-6-14(7-11-16)20-18-4-2-3-5-19(18)23-21(20)15-8-12-17(13-9-15)27(22,24)25/h2-13,23H,1H3,(H2,22,24,25)
n/an/a 0.00603n/an/an/an/an/an/a
TBA
Assay Description
Inhibition of COX2 in Mus musculus (mouse) peritoneal macrophage
Citation and Details
Article DOI: 10.1007/s00044-008-9117-0
BindingDB Entry DOI: 10.7270/Q25T3PBB
Cyclooxygenase
(Homo sapiens (Human))
BDBM50272095
(4-(3-(4-methoxyphenyl)-1H-indol-2-yl)benzenesulfon...)
Show SMILES COc1ccc(cc1)-c1c([nH]c2ccccc12)-c1ccc(cc1)S(N)(=O)=O
Show InChI InChI=1S/C21H18N2O3S/c1-26-16-10-6-14(7-11-16)20-18-4-2-3-5-19(18)23-21(20)15-8-12-17(13-9-15)27(22,24)25/h2-13,23H,1H3,(H2,22,24,25)
NCI pathway
Reactome pathway
n/an/a 6n/an/an/an/an/an/a
Helmholtz-Zentrum Dresden-Rossendorf
Curated by ChEMBL
Assay Description
Inhibition of COX2
Bioorg Med Chem 20: 3410-21 (2012)
Article DOI: 10.1016/j.bmc.2012.04.022
BindingDB Entry DOI: 10.7270/Q2RF5W3X