BDBM50272976 2-((2,6-dimethylmorpholino)methyl)-N-(4-(trifluoromethyl)phenyl)-7-(3-(trifluoromethyl)pyridin-2-yl)quinazolin-4-amine::CHEMBL456162
SMILES: CC1CN(Cc2nc(Nc3ccc(cc3)C(F)(F)F)c3ccc(cc3n2)-c2ncccc2C(F)(F)F)CC(C)O1
InChI Key: InChIKey=CJCRMTDJINOTAK-UHFFFAOYSA-N
Data: 1 IC50
Activity Spreadsheet -- Enzyme Inhibition Constant Data from BindingDB
Found 1 hit for monomerid = 50272976
Trg + Lig
Ki
nM
ΔG°
kcal/mole
IC50
nM
Kd
nM
EC50/IC50
nM
koff
s-1
kon
M-1s-1
pHTemp
°C
Transient receptor potential cation channel subfamily V member 1
(Homo sapiens (Human))
BDBM50272976
(2-((2,6-dimethylmorpholino)methyl)-N-(4-(trifluoro...)
Show SMILES CC1CN(Cc2nc(Nc3ccc(cc3)C(F)(F)F)c3ccc(cc3n2)-c2ncccc2C(F)(F)F)CC(C)O1
Show InChI InChI=1S/C28H25F6N5O/c1-16-13-39(14-17(2)40-16)15-24-37-23-12-18(25-22(28(32,33)34)4-3-11-35-25)5-10-21(23)26(38-24)36-20-8-6-19(7-9-20)27(29,30)31/h3-12,16-17H,13-15H2,1-2H3,(H,36,37,38)
Reactome pathway
n/an/a 0.400n/an/an/an/an/an/a
Neurogen Corporation
Curated by ChEMBL
Assay Description
Antagonist activity at human TRPV1 receptor assessed as inhibition of capsaicin-induced activation
Bioorg Med Chem Lett 18: 4573-7 (2008)
Article DOI: 10.1016/j.bmcl.2008.07.036
BindingDB Entry DOI: 10.7270/Q28P6099