BDBM50273003 CHEMBL456781::[5-(2-Amino-ethyl)-3H-[1,3,4]oxadiazol-2-one Hydrochloride
SMILES: NCCc1n[nH]c(=O)o1
InChI Key: InChIKey=WNSKGEZANNTPQJ-UHFFFAOYSA-N
Data: 1 IC50
Activity Spreadsheet -- Enzyme Inhibition Constant Data from BindingDB
Found 1 hit for monomerid = 50273003
Trg + Lig
Ki
nM
ΔG°
kcal/mole
IC50
nM
Kd
nM
EC50/IC50
nM
koff
s-1
kon
M-1s-1
pHTemp
°C
GABA A receptor alpha-6/beta-2/gamma-2
(RAT)
BDBM50273003
(CHEMBL456781 | [5-(2-Amino-ethyl)-3H-[1,3,4]oxadia...)
Show SMILES NCCc1n[nH]c(=O)o1
Show InChI InChI=1S/C4H7N3O2/c5-2-1-3-6-7-4(8)9-3/h1-2,5H2,(H,7,8)
n/an/a 7.40E+3n/an/an/an/an/an/a
Johannes Gutenberg-UniVersity
Curated by ChEMBL
Assay Description
Displacement of [3H]Muscimol from GABAAalpha6 receptor in Sprague-Dawley rat brain cerebellum membrane
J Med Chem 51: 4430-48 (2008)
Article DOI: 10.1021/jm701562x
BindingDB Entry DOI: 10.7270/Q2FF3S6G