null
SMILES: Cc1cccc(N2CCC(CC2)C(=O)Nc2ccc3OCC(=O)Nc3c2)c1C
InChI Key: InChIKey=LWHWFUUDKRUCSU-UHFFFAOYSA-N
Activity Spreadsheet -- Enzyme Inhibition Constant Data from BindingDB
Found 2 hits for monomerid = 50273022
Trg + Lig
Ki
nM
ΔG°
kcal/mole
IC50
nM
Kd
nM
EC50/IC50
nM
koff
s-1
kon
M-1s-1
pHTemp
°C
Transient receptor potential cation channel subfamily V member 1
(Homo sapiens (Human))
BDBM50273022
(1-(2,3-dimethylphenyl)-N-(3-oxo-3,4-dihydro-2H-ben...)
Show SMILES Cc1cccc(N2CCC(CC2)C(=O)Nc2ccc3OCC(=O)Nc3c2)c1C
Show InChI InChI=1S/C22H25N3O3/c1-14-4-3-5-19(15(14)2)25-10-8-16(9-11-25)22(27)23-17-6-7-20-18(12-17)24-21(26)13-28-20/h3-7,12,16H,8-11,13H2,1-2H3,(H,23,27)(H,24,26)
Reactome pathway
28n/an/an/an/an/an/an/an/a
Johnson & Johnson Pharmaceutical Research and Development
Curated by ChEMBL
Assay Description
Displacement of [3H]RTX from human TRPV1 receptor expressed in HEK293 cell membrane
Bioorg Med Chem Lett 18: 4569-72 (2008)
Article DOI: 10.1016/j.bmcl.2008.07.035
BindingDB Entry DOI: 10.7270/Q2154GV5
Transient receptor potential cation channel subfamily V member 1
(Homo sapiens (Human))
BDBM50273022
(1-(2,3-dimethylphenyl)-N-(3-oxo-3,4-dihydro-2H-ben...)
Show SMILES Cc1cccc(N2CCC(CC2)C(=O)Nc2ccc3OCC(=O)Nc3c2)c1C
Show InChI InChI=1S/C22H25N3O3/c1-14-4-3-5-19(15(14)2)25-10-8-16(9-11-25)22(27)23-17-6-7-20-18(12-17)24-21(26)13-28-20/h3-7,12,16H,8-11,13H2,1-2H3,(H,23,27)(H,24,26)
Reactome pathway
n/an/a 60n/an/an/an/an/an/a
Johnson & Johnson Pharmaceutical Research and Development
Curated by ChEMBL
Assay Description
Antagonist activity at human TRPV1 receptor assessed as inhibition of capsaicin-induced calcium flux by FLIPR
Bioorg Med Chem Lett 18: 4569-72 (2008)
Article DOI: 10.1016/j.bmcl.2008.07.035
BindingDB Entry DOI: 10.7270/Q2154GV5