BDBM50273457 (R)-2-[(S)-1-(4-Fluorophenyl)ethylamino]-5-(2-hydroxypropan-2-yl)-5-methylthiazol-4(5H)-one::CHEMBL456539
SMILES: C[C@H](NC1=NC(=O)[C@](C)(S1)C(C)(C)O)c1ccc(F)cc1
InChI Key: InChIKey=HYVZYASDRIAOPU-VFZGTOFNSA-N
Data: 1 KI  1 IC50
Activity Spreadsheet -- Enzyme Inhibition Constant Data from BindingDB
Found 2 hits for monomerid = 50273457
Trg + Lig
Ki
nM
ΔG°
kcal/mole
IC50
nM
Kd
nM
EC50/IC50
nM
koff
s-1
kon
M-1s-1
pHTemp
°C
11-beta-hydroxysteroid dehydrogenase 1
(Homo sapiens (Human))
BDBM50273457
((R)-2-[(S)-1-(4-Fluorophenyl)ethylamino]-5-(2-hydr...)
Show SMILES C[C@H](NC1=NC(=O)[C@](C)(S1)C(C)(C)O)c1ccc(F)cc1 |r,t:3|
Show InChI InChI=1S/C15H19FN2O2S/c1-9(10-5-7-11(16)8-6-10)17-13-18-12(19)15(4,21-13)14(2,3)20/h5-9,20H,1-4H3,(H,17,18,19)/t9-,15-/m0/s1
Reactome pathway
210n/an/an/an/an/an/an/an/a
Amgen, Inc.
Curated by ChEMBL
Assay Description
Inhibition of human recombinant 11beta-HSD1 expressed in Escherichia coli using [3H]cortisone by scintillation proximity assay
J Med Chem 51: 7953-67 (2008)
Article DOI: 10.1021/jm801073z
BindingDB Entry DOI: 10.7270/Q2FJ2GN7
11-beta-hydroxysteroid dehydrogenase 1
(Homo sapiens (Human))
BDBM50273457
((R)-2-[(S)-1-(4-Fluorophenyl)ethylamino]-5-(2-hydr...)
Show SMILES C[C@H](NC1=NC(=O)[C@](C)(S1)C(C)(C)O)c1ccc(F)cc1 |r,t:3|
Show InChI InChI=1S/C15H19FN2O2S/c1-9(10-5-7-11(16)8-6-10)17-13-18-12(19)15(4,21-13)14(2,3)20/h5-9,20H,1-4H3,(H,17,18,19)/t9-,15-/m0/s1
Reactome pathway
n/an/a 300n/an/an/an/an/an/a
Amgen, Inc.
Curated by ChEMBL
Assay Description
Inhibition of human 11beta-HSD1 expressed in CHO cells assessed as conversion of cortisone to cortisol by ELISA
J Med Chem 51: 7953-67 (2008)
Article DOI: 10.1021/jm801073z
BindingDB Entry DOI: 10.7270/Q2FJ2GN7