BDBM50273767 (4S,7S,10S,13S,16S,22S,25S,28S,31S,34S,37S,40S,43S,46S,49S,52S,58S)-4-((2S,3S)-1-((S)-1-((2S,5S,8S,11S,20S)-2-((1H-indol-3-yl)methyl)-11-(2-((S)-1-amino-5-guanidino-1-oxopentan-2-ylamino)-2-oxoethylcarbamoyl)-5-isobutyl-8-isopropyl-3,6,9,14,21-pentaoxo-1,4,7,10,15-pentaazacyclohenicosan-20-ylamino)-1-oxo-3-phenylpropan-2-ylamino)-3-methyl-1-oxopentan-2-ylcarbamoyl)-58-((S)-2-((S)-2-amino-3-(1H-imidazol-5-yl)propanamido)propanamido)-16-(3-amino-3-oxopropyl)-7-(4-aminobutyl)-49-benzyl-22-(2-carbox::CHEMBL503693
SMILES: CC[C@H](C)[C@H](NC(=O)[C@H](CCC(O)=O)NC(=O)[C@H](CCCCN)NC(=O)[C@H](C)NC(=O)[C@H](C)NC(=O)[C@H](CCC(N)=O)NC(=O)CNC(=O)[C@H](CCC(O)=O)NC(=O)[C@H](CC(C)C)NC(=O)[C@H](Cc1ccc(O)cc1)NC(=O)[C@H](CO)NC(=O)[C@H](CO)NC(=O)[C@@H](NC(=O)[C@H](CC(O)=O)NC(=O)[C@H](CO)NC(=O)[C@@H](NC(=O)[C@H](Cc1ccccc1)NC(=O)[C@@H](NC(=O)CNC(=O)[C@H](CCC(O)=O)NC(=O)[C@H](C)NC(=O)[C@@H](N)Cc1cnc[nH]1)[C@@H](C)O)[C@@H](C)O)C(C)C)C(=O)N[C@@H](Cc1ccccc1)C(=O)N[C@H]1CCCCNC(=O)CC[C@H](NC(=O)[C@@H](NC(=O)[C@H](CC(C)C)NC(=O)[C@H](Cc2c[nH]c3ccccc23)NC1=O)C(C)C)C(=O)NCC(=O)N[C@@H](CCCNC(N)=N)C(N)=O
InChI Key: InChIKey=CYJLAZUBSDMCSO-JVALEFNKSA-N
Data: 1 IC50  1 EC50
Activity Spreadsheet -- Enzyme Inhibition Constant Data from BindingDB
Found 2 hits for monomerid = 50273767
Trg + Lig
Ki
nM
ΔG°
kcal/mole
IC50
nM
Kd
nM
EC50/IC50
nM
koff
s-1
kon
M-1s-1
pHTemp
°C
Glucagon-like peptide 1 receptor (GLP-1)
(Homo sapiens (Human))
BDBM50273767
((4S,7S,10S,13S,16S,22S,25S,28S,31S,34S,37S,40S,43S...)
Show SMILES CC[C@H](C)[C@H](NC(=O)[C@H](CCC(O)=O)NC(=O)[C@H](CCCCN)NC(=O)[C@H](C)NC(=O)[C@H](C)NC(=O)[C@H](CCC(N)=O)NC(=O)CNC(=O)[C@H](CCC(O)=O)NC(=O)[C@H](CC(C)C)NC(=O)[C@H](Cc1ccc(O)cc1)NC(=O)[C@H](CO)NC(=O)[C@H](CO)NC(=O)[C@@H](NC(=O)[C@H](CC(O)=O)NC(=O)[C@H](CO)NC(=O)[C@@H](NC(=O)[C@H](Cc1ccccc1)NC(=O)[C@@H](NC(=O)CNC(=O)[C@H](CCC(O)=O)NC(=O)[C@H](C)NC(=O)[C@@H](N)Cc1cnc[nH]1)[C@@H](C)O)[C@@H](C)O)C(C)C)C(=O)N[C@@H](Cc1ccccc1)C(=O)N[C@H]1CCCCNC(=O)CC[C@H](NC(=O)[C@@H](NC(=O)[C@H](CC(C)C)NC(=O)[C@H](Cc2c[nH]c3ccccc23)NC1=O)C(C)C)C(=O)NCC(=O)N[C@@H](CCCNC(N)=N)C(N)=O |r|
Show InChI InChI=1S/C151H226N40O46/c1-16-77(10)121(148(235)182-103(58-83-30-19-17-20-31-83)137(224)173-94-37-26-28-54-159-111(199)49-44-95(129(216)162-66-112(200)169-92(124(155)211)38-29-55-160-151(156)157)176-146(233)119(75(6)7)188-140(227)101(57-74(4)5)178-139(226)105(180-134(94)221)61-86-64-161-91-35-24-23-34-89(86)91)190-135(222)99(47-52-117(207)208)175-133(220)93(36-25-27-53-152)171-126(213)79(12)166-125(212)78(11)168-132(219)98(43-48-110(154)198)170-113(201)67-163-131(218)97(46-51-116(205)206)174-136(223)100(56-73(2)3)177-138(225)102(60-85-39-41-88(197)42-40-85)179-143(230)107(69-192)184-145(232)109(71-194)185-147(234)120(76(8)9)189-142(229)106(63-118(209)210)181-144(231)108(70-193)186-150(237)123(82(15)196)191-141(228)104(59-84-32-21-18-22-33-84)183-149(236)122(81(14)195)187-114(202)68-164-130(217)96(45-50-115(203)204)172-127(214)80(13)167-128(215)90(153)62-87-65-158-72-165-87/h17-24,30-35,39-42,64-65,72-82,90,92-109,119-123,161,192-197H,16,25-29,36-38,43-63,66-71,152-153H2,1-15H3,(H2,154,198)(H2,155,211)(H,158,165)(H,159,199)(H,162,216)(H,163,218)(H,164,217)(H,166,212)(H,167,215)(H,168,219)(H,169,200)(H,170,201)(H,171,213)(H,172,214)(H,173,224)(H,174,223)(H,175,220)(H,176,233)(H,177,225)(H,178,226)(H,179,230)(H,180,221)(H,181,231)(H,182,235)(H,183,236)(H,184,232)(H,185,234)(H,186,237)(H,187,202)(H,188,227)(H,189,229)(H,190,222)(H,191,228)(H,203,204)(H,205,206)(H,207,208)(H,209,210)(H4,156,157,160)/t77-,78-,79-,80-,81+,82+,90-,92-,93-,94-,95-,96-,97-,98-,99-,100-,101-,102-,103-,104-,105-,106-,107-,108-,109-,119-,120-,121-,122-,123-/m0/s1
n/an/a 1.40n/an/an/an/an/an/a
University of Texas at Dallas
Curated by ChEMBL
Assay Description
Displacement of [125I]exendin(9-39) from human GLP1R expressed in HEK293 cells
Bioorg Med Chem 16: 10106-12 (2008)
Article DOI: 10.1016/j.bmc.2008.10.006
BindingDB Entry DOI: 10.7270/Q2B857ZT
Glucagon-like peptide 1 receptor (GLP-1)
(Homo sapiens (Human))
BDBM50273767
((4S,7S,10S,13S,16S,22S,25S,28S,31S,34S,37S,40S,43S...)
Show SMILES CC[C@H](C)[C@H](NC(=O)[C@H](CCC(O)=O)NC(=O)[C@H](CCCCN)NC(=O)[C@H](C)NC(=O)[C@H](C)NC(=O)[C@H](CCC(N)=O)NC(=O)CNC(=O)[C@H](CCC(O)=O)NC(=O)[C@H](CC(C)C)NC(=O)[C@H](Cc1ccc(O)cc1)NC(=O)[C@H](CO)NC(=O)[C@H](CO)NC(=O)[C@@H](NC(=O)[C@H](CC(O)=O)NC(=O)[C@H](CO)NC(=O)[C@@H](NC(=O)[C@H](Cc1ccccc1)NC(=O)[C@@H](NC(=O)CNC(=O)[C@H](CCC(O)=O)NC(=O)[C@H](C)NC(=O)[C@@H](N)Cc1cnc[nH]1)[C@@H](C)O)[C@@H](C)O)C(C)C)C(=O)N[C@@H](Cc1ccccc1)C(=O)N[C@H]1CCCCNC(=O)CC[C@H](NC(=O)[C@@H](NC(=O)[C@H](CC(C)C)NC(=O)[C@H](Cc2c[nH]c3ccccc23)NC1=O)C(C)C)C(=O)NCC(=O)N[C@@H](CCCNC(N)=N)C(N)=O |r|
Show InChI InChI=1S/C151H226N40O46/c1-16-77(10)121(148(235)182-103(58-83-30-19-17-20-31-83)137(224)173-94-37-26-28-54-159-111(199)49-44-95(129(216)162-66-112(200)169-92(124(155)211)38-29-55-160-151(156)157)176-146(233)119(75(6)7)188-140(227)101(57-74(4)5)178-139(226)105(180-134(94)221)61-86-64-161-91-35-24-23-34-89(86)91)190-135(222)99(47-52-117(207)208)175-133(220)93(36-25-27-53-152)171-126(213)79(12)166-125(212)78(11)168-132(219)98(43-48-110(154)198)170-113(201)67-163-131(218)97(46-51-116(205)206)174-136(223)100(56-73(2)3)177-138(225)102(60-85-39-41-88(197)42-40-85)179-143(230)107(69-192)184-145(232)109(71-194)185-147(234)120(76(8)9)189-142(229)106(63-118(209)210)181-144(231)108(70-193)186-150(237)123(82(15)196)191-141(228)104(59-84-32-21-18-22-33-84)183-149(236)122(81(14)195)187-114(202)68-164-130(217)96(45-50-115(203)204)172-127(214)80(13)167-128(215)90(153)62-87-65-158-72-165-87/h17-24,30-35,39-42,64-65,72-82,90,92-109,119-123,161,192-197H,16,25-29,36-38,43-63,66-71,152-153H2,1-15H3,(H2,154,198)(H2,155,211)(H,158,165)(H,159,199)(H,162,216)(H,163,218)(H,164,217)(H,166,212)(H,167,215)(H,168,219)(H,169,200)(H,170,201)(H,171,213)(H,172,214)(H,173,224)(H,174,223)(H,175,220)(H,176,233)(H,177,225)(H,178,226)(H,179,230)(H,180,221)(H,181,231)(H,182,235)(H,183,236)(H,184,232)(H,185,234)(H,186,237)(H,187,202)(H,188,227)(H,189,229)(H,190,222)(H,191,228)(H,203,204)(H,205,206)(H,207,208)(H,209,210)(H4,156,157,160)/t77-,78-,79-,80-,81+,82+,90-,92-,93-,94-,95-,96-,97-,98-,99-,100-,101-,102-,103-,104-,105-,106-,107-,108-,109-,119-,120-,121-,122-,123-/m0/s1
n/an/an/an/a 0.00209n/an/an/an/a
University of Texas at Dallas
Curated by ChEMBL
Assay Description
Activation of human GLP1R expressed in HEK293 cells assessed as effect on cAMP responsive element promoter driven luciferase expression
Bioorg Med Chem 16: 10106-12 (2008)
Article DOI: 10.1016/j.bmc.2008.10.006
BindingDB Entry DOI: 10.7270/Q2B857ZT