BDBM50273825 1-(4-{2-[(S)-1-(4-Fluorophenyl)ethylamino]-5-methyl-4-oxo-4,5-dihydrothiazol-5-yl}phenyl)cyclopropanecarboxamide::CHEMBL459966
SMILES: C[C@H](NC1=NC(=O)C(C)(S1)c1ccc(cc1)C1(CC1)C(N)=O)c1ccc(F)cc1
InChI Key: InChIKey=XZVYHDOKKMKZAQ-JRTLGTJJSA-N
Data: 1 KI  1 IC50
Activity Spreadsheet -- Enzyme Inhibition Constant Data from BindingDB
Found 2 hits for monomerid = 50273825
Trg + Lig
Ki
nM
ΔG°
kcal/mole
IC50
nM
Kd
nM
EC50/IC50
nM
koff
s-1
kon
M-1s-1
pHTemp
°C
11-beta-hydroxysteroid dehydrogenase 1
(Homo sapiens (Human))
BDBM50273825
(1-(4-{2-[(S)-1-(4-Fluorophenyl)ethylamino]-5-methy...)
Show SMILES C[C@H](NC1=NC(=O)C(C)(S1)c1ccc(cc1)C1(CC1)C(N)=O)c1ccc(F)cc1 |r,t:3|
Show InChI InChI=1S/C22H22FN3O2S/c1-13(14-3-9-17(23)10-4-14)25-20-26-19(28)21(2,29-20)15-5-7-16(8-6-15)22(11-12-22)18(24)27/h3-10,13H,11-12H2,1-2H3,(H2,24,27)(H,25,26,28)/t13-,21?/m0/s1
Reactome pathway
30n/an/an/an/an/an/an/an/a
Amgen, Inc.
Curated by ChEMBL
Assay Description
Inhibition of human recombinant 11beta-HSD1 expressed in Escherichia coli using [3H]cortisone by scintillation proximity assay
J Med Chem 51: 7953-67 (2008)
Article DOI: 10.1021/jm801073z
BindingDB Entry DOI: 10.7270/Q2FJ2GN7
11-beta-hydroxysteroid dehydrogenase 1
(Homo sapiens (Human))
BDBM50273825
(1-(4-{2-[(S)-1-(4-Fluorophenyl)ethylamino]-5-methy...)
Show SMILES C[C@H](NC1=NC(=O)C(C)(S1)c1ccc(cc1)C1(CC1)C(N)=O)c1ccc(F)cc1 |r,t:3|
Show InChI InChI=1S/C22H22FN3O2S/c1-13(14-3-9-17(23)10-4-14)25-20-26-19(28)21(2,29-20)15-5-7-16(8-6-15)22(11-12-22)18(24)27/h3-10,13H,11-12H2,1-2H3,(H2,24,27)(H,25,26,28)/t13-,21?/m0/s1
Reactome pathway
n/an/a 110n/an/an/an/an/an/a
Amgen, Inc.
Curated by ChEMBL
Assay Description
Inhibition of human 11beta-HSD1 expressed in CHO cells assessed as conversion of cortisone to cortisol by ELISA
J Med Chem 51: 7953-67 (2008)
Article DOI: 10.1021/jm801073z
BindingDB Entry DOI: 10.7270/Q2FJ2GN7