BDBM50273863 CHEMBL460827::tert-Butyl-4-[1-(4-fuluorophenyl)-1H-1,2,3-triazol-4-yl]-3,6-dihydropyridine-1(2H)-carboxylate
SMILES: CC(C)(C)OC(=O)N1CCC(=CC1)c1cn(nn1)-c1ccc(F)cc1
InChI Key: InChIKey=KSSMUDDDTIMETC-UHFFFAOYSA-N
Data: 3 IC50
Activity Spreadsheet -- Enzyme Inhibition Constant Data from BindingDB
Found 3 hits for monomerid = 50273863
Trg + Lig
Ki
nM
ΔG°
kcal/mole
IC50
nM
Kd
nM
EC50/IC50
nM
koff
s-1
kon
M-1s-1
pHTemp
°C
Metabotropic glutamate receptor 1
(Homo sapiens (Human))
BDBM50273863
(CHEMBL460827 | tert-Butyl-4-[1-(4-fuluorophenyl)-1...)
Show SMILES CC(C)(C)OC(=O)N1CCC(=CC1)c1cn(nn1)-c1ccc(F)cc1 |c:10|
Show InChI InChI=1S/C18H21FN4O2/c1-18(2,3)25-17(24)22-10-8-13(9-11-22)16-12-23(21-20-16)15-6-4-14(19)5-7-15/h4-8,12H,9-11H2,1-3H3
n/an/a 16n/an/an/an/an/an/a
Tsukuba Research Institute
Curated by ChEMBL
Assay Description
Antagonist activity at human mGluR1 expressed in CHO cells assessed as calcium flux by FLIPR assay
Bioorg Med Chem 16: 9817-29 (2008)
Article DOI: 10.1016/j.bmc.2008.09.060
BindingDB Entry DOI: 10.7270/Q2QN66K2
Metabotropic glutamate receptor 5
(Homo sapiens (Human))
BDBM50273863
(CHEMBL460827 | tert-Butyl-4-[1-(4-fuluorophenyl)-1...)
Show SMILES CC(C)(C)OC(=O)N1CCC(=CC1)c1cn(nn1)-c1ccc(F)cc1 |c:10|
Show InChI InChI=1S/C18H21FN4O2/c1-18(2,3)25-17(24)22-10-8-13(9-11-22)16-12-23(21-20-16)15-6-4-14(19)5-7-15/h4-8,12H,9-11H2,1-3H3
n/an/a 1.10E+3n/an/an/an/an/an/a
Tsukuba Research Institute
Curated by ChEMBL
Assay Description
Antagonist activity at human mGluR5 expressed in CHO cells assessed as calcium flux by FLIPR assay
Bioorg Med Chem 16: 9817-29 (2008)
Article DOI: 10.1016/j.bmc.2008.09.060
BindingDB Entry DOI: 10.7270/Q2QN66K2
Metabotropic glutamate receptor 1
(Mus musculus)
BDBM50273863
(CHEMBL460827 | tert-Butyl-4-[1-(4-fuluorophenyl)-1...)
Show SMILES CC(C)(C)OC(=O)N1CCC(=CC1)c1cn(nn1)-c1ccc(F)cc1 |c:10|
Show InChI InChI=1S/C18H21FN4O2/c1-18(2,3)25-17(24)22-10-8-13(9-11-22)16-12-23(21-20-16)15-6-4-14(19)5-7-15/h4-8,12H,9-11H2,1-3H3
Reactome pathway
n/an/a 31n/an/an/an/an/an/a
Tsukuba Research Institute
Curated by ChEMBL
Assay Description
Antagonist activity at mouse mGluR1 expressed in CHO cells assessed as calcium flux by FLIPR assay
Bioorg Med Chem 16: 9817-29 (2008)
Article DOI: 10.1016/j.bmc.2008.09.060
BindingDB Entry DOI: 10.7270/Q2QN66K2