BDBM50274154 CHEMBL519033::N-(1-(3-amino-3-oxopropyl)-5-(4,4-difluoro-N-methylcyclohexanecarboxamido)-1H-benzo[d]imidazol-2-yl)-4-cyanobenzamide
SMILES: CN(C(=O)C1CCC(F)(F)CC1)c1ccc2n(CCC(N)=O)c(NC(=O)c3ccc(cc3)C#N)nc2c1
InChI Key: InChIKey=NVSGAXVEUPIOOQ-UHFFFAOYSA-N
Data: 2 IC50
Activity Spreadsheet -- Enzyme Inhibition Constant Data from BindingDB
Found 2 hits for monomerid = 50274154
Trg + Lig
Ki
nM
ΔG°
kcal/mole
IC50
nM
Kd
nM
EC50/IC50
nM
koff
s-1
kon
M-1s-1
pHTemp
°C
Tyrosine-protein kinase ITK/TSK
(Homo sapiens (Human))
BDBM50274154
(CHEMBL519033 | N-(1-(3-amino-3-oxopropyl)-5-(4,4-d...)
Show SMILES CN(C(=O)C1CCC(F)(F)CC1)c1ccc2n(CCC(N)=O)c(NC(=O)c3ccc(cc3)C#N)nc2c1
Show InChI InChI=1S/C26H26F2N6O3/c1-33(24(37)18-8-11-26(27,28)12-9-18)19-6-7-21-20(14-19)31-25(34(21)13-10-22(30)35)32-23(36)17-4-2-16(15-29)3-5-17/h2-7,14,18H,8-13H2,1H3,(H2,30,35)(H,31,32,36)
Reactome pathway
n/an/a 2.30E+3n/an/an/an/an/an/a
Johnson & Johnson
Curated by ChEMBL
Assay Description
Inhibition of human ITK expressed in chicken DT40 cells assessed as B cell receptor-stimulated calcium influx by FLIPR assay
Bioorg Med Chem Lett 18: 5537-40 (2008)
Article DOI: 10.1016/j.bmcl.2008.09.017
BindingDB Entry DOI: 10.7270/Q208655Z
Tyrosine-protein kinase ITK/TSK
(Homo sapiens (Human))
BDBM50274154
(CHEMBL519033 | N-(1-(3-amino-3-oxopropyl)-5-(4,4-d...)
Show SMILES CN(C(=O)C1CCC(F)(F)CC1)c1ccc2n(CCC(N)=O)c(NC(=O)c3ccc(cc3)C#N)nc2c1
Show InChI InChI=1S/C26H26F2N6O3/c1-33(24(37)18-8-11-26(27,28)12-9-18)19-6-7-21-20(14-19)31-25(34(21)13-10-22(30)35)32-23(36)17-4-2-16(15-29)3-5-17/h2-7,14,18H,8-13H2,1H3,(H2,30,35)(H,31,32,36)
Reactome pathway
n/an/a 8n/an/an/an/an/an/a
Johnson & Johnson
Curated by ChEMBL
Assay Description
Inhibition of recombinant ITK (unknown origin) by DELFIA assay
Bioorg Med Chem Lett 18: 5537-40 (2008)
Article DOI: 10.1016/j.bmcl.2008.09.017
BindingDB Entry DOI: 10.7270/Q208655Z