BDBM50274239 CHEMBL503621::p-Methoxyphenyl (9-amino-3,5,9-trideoxy-5-glycolamido-D-glycero-alpha-D-galacto-2-nonulopyranosylonic acid)-(2->6)-beta-D-galactopyranoside
SMILES: COc1ccc(O[C@@H]2O[C@H](CO[C@@]3(C[C@H](O)[C@@H](NC(=O)CO)[C@@H](O3)[C@H](O)[C@H](O)CN)C(O)=O)[C@H](O)[C@H](O)[C@H]2O)cc1
InChI Key: InChIKey=VWHDAPLZPAOSHZ-OUIOXYPCSA-N
Data: 1 IC50
Activity Spreadsheet -- Enzyme Inhibition Constant Data from BindingDB
Found 1 hit for monomerid = 50274239
Trg + Lig
Ki
nM
ΔG°
kcal/mole
IC50
nM
Kd
nM
EC50/IC50
nM
koff
s-1
kon
M-1s-1
pHTemp
°C
B-cell receptor CD22
(Homo sapiens (Human))
BDBM50274239
(CHEMBL503621 | p-Methoxyphenyl (9-amino-3,5,9-trid...)
Show SMILES COc1ccc(O[C@@H]2O[C@H](CO[C@@]3(C[C@H](O)[C@@H](NC(=O)CO)[C@@H](O3)[C@H](O)[C@H](O)CN)C(O)=O)[C@H](O)[C@H](O)[C@H]2O)cc1 |r|
Show InChI InChI=1S/C24H36N2O15/c1-37-10-2-4-11(5-3-10)39-22-20(34)19(33)18(32)14(40-22)9-38-24(23(35)36)6-12(28)16(26-15(30)8-27)21(41-24)17(31)13(29)7-25/h2-5,12-14,16-22,27-29,31-34H,6-9,25H2,1H3,(H,26,30)(H,35,36)/t12-,13+,14+,16+,17+,18-,19-,20+,21+,22+,24+/m0/s1
NCI pathway
n/an/a 8.50E+4n/an/an/an/an/an/a
Gifu University
Curated by ChEMBL
Assay Description
Binding affinity to biotinylated human CD22-human IgG1 chimeric protein expressed in mouse J558LST6 cells by flow cytometry
J Med Chem 51: 6665-81 (2008)
Article DOI: 10.1021/jm8000696
BindingDB Entry DOI: 10.7270/Q23X86GN