BDBM50274286 CHEMBL505684::p-Methoxyphenyl (3,5,9-trideoxy-5-glycolamido-9-(3-phenylpropionamido)-D-glycero-alpha-D-galacto-2-nonulopyranosylonic acid)-(2->6)-beta-D-galactopyranoside
SMILES: COc1ccc(O[C@@H]2O[C@H](CO[C@@]3(C[C@H](O)[C@@H](NC(=O)CO)[C@@H](O3)[C@H](O)[C@H](O)CNC(=O)CCc3ccccc3)C(O)=O)[C@H](O)[C@H](O)[C@H]2O)cc1
InChI Key: InChIKey=BYLUEHHQMQLGSO-YFHCUYOWSA-N
Data: 1 IC50
Activity Spreadsheet -- Enzyme Inhibition Constant Data from BindingDB
Found 1 hit for monomerid = 50274286
Trg + Lig
Ki
nM
ΔG°
kcal/mole
IC50
nM
Kd
nM
EC50/IC50
nM
koff
s-1
kon
M-1s-1
pHTemp
°C
CD22
(Homo sapiens (Human))
BDBM50274286
(CHEMBL505684 | p-Methoxyphenyl (3,5,9-trideoxy-5-g...)
Show SMILES COc1ccc(O[C@@H]2O[C@H](CO[C@@]3(C[C@H](O)[C@@H](NC(=O)CO)[C@@H](O3)[C@H](O)[C@H](O)CNC(=O)CCc3ccccc3)C(O)=O)[C@H](O)[C@H](O)[C@H]2O)cc1 |r|
Show InChI InChI=1S/C33H44N2O16/c1-47-18-8-10-19(11-9-18)49-31-29(44)28(43)27(42)22(50-31)16-48-33(32(45)46)13-20(37)25(35-24(40)15-36)30(51-33)26(41)21(38)14-34-23(39)12-7-17-5-3-2-4-6-17/h2-6,8-11,20-22,25-31,36-38,41-44H,7,12-16H2,1H3,(H,34,39)(H,35,40)(H,45,46)/t20-,21+,22+,25+,26+,27-,28-,29+,30+,31+,33+/m0/s1
NCI pathway
n/an/a 1.04E+4n/an/an/an/an/an/a
Gifu University
Curated by ChEMBL
Assay Description
Binding affinity to biotinylated human CD22-human IgG1 chimeric protein expressed in mouse J558LST6 cells by flow cytometry
J Med Chem 51: 6665-81 (2008)
Article DOI: 10.1021/jm8000696
BindingDB Entry DOI: 10.7270/Q23X86GN