BDBM50274292 CHEMBL509768::p-Methoxyphenyl (3,5,9-trideoxy-5-glycolamido-9-(4beta-hydroxy-4-biphenyl-carboxamido)-D-glycero-alpha-D-galacto-2-nonulopyranosylonicacid)-(2->6)-beta-D-galactopyranoside
SMILES: COc1ccc(O[C@@H]2O[C@H](CO[C@@]3(C[C@H](O)[C@@H](NC(=O)CO)[C@@H](O3)[C@H](O)[C@H](O)CNC(=O)c3ccc(cc3)-c3ccc(O)cc3)C(O)=O)[C@H](O)[C@H](O)[C@H]2O)cc1
InChI Key: InChIKey=RHNNBOLUOGPAJV-CYOLFESQSA-N
Data: 1 IC50
Activity Spreadsheet -- Enzyme Inhibition Constant Data from BindingDB
Found 1 hit for monomerid = 50274292
Trg + Lig
Ki
nM
ΔG°
kcal/mole
IC50
nM
Kd
nM
EC50/IC50
nM
koff
s-1
kon
M-1s-1
pHTemp
°C
CD22
(Homo sapiens (Human))
BDBM50274292
(CHEMBL509768 | p-Methoxyphenyl (3,5,9-trideoxy-5-g...)
Show SMILES COc1ccc(O[C@@H]2O[C@H](CO[C@@]3(C[C@H](O)[C@@H](NC(=O)CO)[C@@H](O3)[C@H](O)[C@H](O)CNC(=O)c3ccc(cc3)-c3ccc(O)cc3)C(O)=O)[C@H](O)[C@H](O)[C@H]2O)cc1 |r|
Show InChI InChI=1S/C37H44N2O17/c1-52-22-10-12-23(13-11-22)54-35-32(48)31(47)30(46)26(55-35)17-53-37(36(50)51)14-24(42)28(39-27(44)16-40)33(56-37)29(45)25(43)15-38-34(49)20-4-2-18(3-5-20)19-6-8-21(41)9-7-19/h2-13,24-26,28-33,35,40-43,45-48H,14-17H2,1H3,(H,38,49)(H,39,44)(H,50,51)/t24-,25+,26+,28+,29+,30-,31-,32+,33+,35+,37+/m0/s1
NCI pathway
n/an/a 400n/an/an/an/an/an/a
Gifu University
Curated by ChEMBL
Assay Description
Binding affinity to biotinylated human CD22-human IgG1 chimeric protein expressed in mouse J558LST6 cells by flow cytometry
J Med Chem 51: 6665-81 (2008)
Article DOI: 10.1021/jm8000696
BindingDB Entry DOI: 10.7270/Q23X86GN