BDBM50274306 CHEMBL505326::p-Methoxyphenyl (3,5,9-trideoxy-5-glycolamido-9-(3'-hydroxy-4-biphenyl)-methylamino-D-glycero-alpha-D-galacto-2-nonulopyranosylonicacid)-(2->6)-beta-D-galactopyranoside
SMILES: COc1ccc(O[C@@H]2O[C@H](CO[C@@]3(C[C@H](O)[C@@H](NC(=O)CO)[C@@H](O3)[C@H](O)[C@H](O)CNCc3ccc(cc3)-c3cccc(O)c3)C(O)=O)[C@H](O)[C@H](O)[C@H]2O)cc1
InChI Key: InChIKey=ZXIOSKUJBCNKEQ-GFYPMFDPSA-N
Data: 1 IC50
Activity Spreadsheet -- Enzyme Inhibition Constant Data from BindingDB
Found 1 hit for monomerid = 50274306
Trg + Lig
Ki
nM
ΔG°
kcal/mole
IC50
nM
Kd
nM
EC50/IC50
nM
koff
s-1
kon
M-1s-1
pHTemp
°C
CD22
(Homo sapiens (Human))
BDBM50274306
(CHEMBL505326 | p-Methoxyphenyl (3,5,9-trideoxy-5-g...)
Show SMILES COc1ccc(O[C@@H]2O[C@H](CO[C@@]3(C[C@H](O)[C@@H](NC(=O)CO)[C@@H](O3)[C@H](O)[C@H](O)CNCc3ccc(cc3)-c3cccc(O)c3)C(O)=O)[C@H](O)[C@H](O)[C@H]2O)cc1 |r|
Show InChI InChI=1S/C37H46N2O16/c1-51-23-9-11-24(12-10-23)53-35-33(48)32(47)31(46)27(54-35)18-52-37(36(49)50)14-25(42)29(39-28(44)17-40)34(55-37)30(45)26(43)16-38-15-19-5-7-20(8-6-19)21-3-2-4-22(41)13-21/h2-13,25-27,29-35,38,40-43,45-48H,14-18H2,1H3,(H,39,44)(H,49,50)/t25-,26+,27+,29+,30+,31-,32-,33+,34+,35+,37+/m0/s1
NCI pathway
n/an/a 1.73E+3n/an/an/an/an/an/a
Gifu University
Curated by ChEMBL
Assay Description
Binding affinity to biotinylated human CD22-human IgG1 chimeric protein expressed in mouse J558LST6 cells by flow cytometry
J Med Chem 51: 6665-81 (2008)
Article DOI: 10.1021/jm8000696
BindingDB Entry DOI: 10.7270/Q23X86GN