BDBM50274392 CHEMBL484940::N-(1-(3-amino-3-oxopropyl)-5-(N-methylcyclohexanecarboxamido)-1H-benzo[d]imidazol-2-yl)-4-methoxybenzamide
SMILES: COc1ccc(cc1)C(=O)Nc1nc2cc(ccc2n1CCC(N)=O)N(C)C(=O)C1CCCCC1
InChI Key: InChIKey=RNEFFUKHZIEUKT-UHFFFAOYSA-N
Data: 2 IC50
Activity Spreadsheet -- Enzyme Inhibition Constant Data from BindingDB
Found 2 hits for monomerid = 50274392
Trg + Lig
Ki
nM
ΔG°
kcal/mole
IC50
nM
Kd
nM
EC50/IC50
nM
koff
s-1
kon
M-1s-1
pHTemp
°C
Tyrosine-protein kinase ITK/TSK
(Homo sapiens (Human))
BDBM50274392
(CHEMBL484940 | N-(1-(3-amino-3-oxopropyl)-5-(N-met...)
Show SMILES COc1ccc(cc1)C(=O)Nc1nc2cc(ccc2n1CCC(N)=O)N(C)C(=O)C1CCCCC1
Show InChI InChI=1S/C26H31N5O4/c1-30(25(34)18-6-4-3-5-7-18)19-10-13-22-21(16-19)28-26(31(22)15-14-23(27)32)29-24(33)17-8-11-20(35-2)12-9-17/h8-13,16,18H,3-7,14-15H2,1-2H3,(H2,27,32)(H,28,29,33)
Reactome pathway
n/an/a 12n/an/an/an/an/an/a
Johnson & Johnson
Curated by ChEMBL
Assay Description
Inhibition of ITK by DELFIA assay
Bioorg Med Chem Lett 18: 5545-9 (2008)
Article DOI: 10.1016/j.bmcl.2008.09.015
BindingDB Entry DOI: 10.7270/Q2M32VMD
Insulin receptor
(Homo sapiens (Human))
BDBM50274392
(CHEMBL484940 | N-(1-(3-amino-3-oxopropyl)-5-(N-met...)
Show SMILES COc1ccc(cc1)C(=O)Nc1nc2cc(ccc2n1CCC(N)=O)N(C)C(=O)C1CCCCC1
Show InChI InChI=1S/C26H31N5O4/c1-30(25(34)18-6-4-3-5-7-18)19-10-13-22-21(16-19)28-26(31(22)15-14-23(27)32)29-24(33)17-8-11-20(35-2)12-9-17/h8-13,16,18H,3-7,14-15H2,1-2H3,(H2,27,32)(H,28,29,33)
n/an/a>1.00E+4n/an/an/an/an/an/a
Johnson & Johnson
Curated by ChEMBL
Assay Description
Inhibition of IRK
Bioorg Med Chem Lett 18: 5545-9 (2008)
Article DOI: 10.1016/j.bmcl.2008.09.015
BindingDB Entry DOI: 10.7270/Q2M32VMD