BDBM50274452 CHEMBL506825::FGGFTGARKSARKKRNQ
SMILES: [#6]-[#6@@H](-[#8])-[#6@H](-[#7]-[#6](=O)-[#6@H](-[#6]-c1ccccc1)-[#7]-[#6](=O)-[#6]-[#7]-[#6](=O)-[#6]-[#7]-[#6](=O)-[#6@@H](-[#7])-[#6]-c1ccccc1)-[#6](=O)-[#7]-[#6]-[#6](=O)-[#7]-[#6@@H](-[#6])-[#6](=O)-[#7]-[#6@@H](-[#6]-[#6]-[#6]\[#7]=[#6](/[#7])-[#7])-[#6](=O)-[#7]-[#6@@H](-[#6]-[#6]-[#6]-[#6]-[#7])-[#6](=O)-[#7]-[#6@@H](-[#6]-[#8])-[#6](=O)-[#7]-[#6@@H](-[#6])-[#6](=O)-[#7]-[#6@@H](-[#6]-[#6]-[#6]\[#7]=[#6](/[#7])-[#7])-[#6](=O)-[#7]-[#6@@H](-[#6]-[#6]-[#6]-[#6]-[#7])-[#6](=O)-[#7]-[#6@@H](-[#6]-[#6]-[#6]-[#6]-[#7])-[#6](=O)-[#7]-[#6@@H](-[#6]-[#6]-[#6]\[#7]=[#6](/[#7])-[#7])-[#6](=O)-[#7]-[#6@@H](-[#6]-[#6](-[#7])=O)-[#6](=O)-[#7]-[#6@@H](-[#6]-[#6]-[#6](-[#7])=O)-[#6](-[#8])=O
InChI Key: InChIKey=LIKGHYIDQTYXFY-VUXBHJHDSA-N
Data: 1 IC50  1 EC50
Activity Spreadsheet -- Enzyme Inhibition Constant Data from BindingDB
Found 2 hits for monomerid = 50274452
Trg + Lig
Ki
nM
ΔG°
kcal/mole
IC50
nM
Kd
nM
EC50/IC50
nM
koff
s-1
kon
M-1s-1
pHTemp
°C
Nociceptin/Orphanin FQ, NOP receptor
(RAT)
BDBM50274452
(CHEMBL506825 | FGGFTGARKSARKKRNQ)
Show SMILES [#6]-[#6@@H](-[#8])-[#6@H](-[#7]-[#6](=O)-[#6@H](-[#6]-c1ccccc1)-[#7]-[#6](=O)-[#6]-[#7]-[#6](=O)-[#6]-[#7]-[#6](=O)-[#6@@H](-[#7])-[#6]-c1ccccc1)-[#6](=O)-[#7]-[#6]-[#6](=O)-[#7]-[#6@@H](-[#6])-[#6](=O)-[#7]-[#6@@H](-[#6]-[#6]-[#6]\[#7]=[#6](/[#7])-[#7])-[#6](=O)-[#7]-[#6@@H](-[#6]-[#6]-[#6]-[#6]-[#7])-[#6](=O)-[#7]-[#6@@H](-[#6]-[#8])-[#6](=O)-[#7]-[#6@@H](-[#6])-[#6](=O)-[#7]-[#6@@H](-[#6]-[#6]-[#6]\[#7]=[#6](/[#7])-[#7])-[#6](=O)-[#7]-[#6@@H](-[#6]-[#6]-[#6]-[#6]-[#7])-[#6](=O)-[#7]-[#6@@H](-[#6]-[#6]-[#6]-[#6]-[#7])-[#6](=O)-[#7]-[#6@@H](-[#6]-[#6]-[#6]\[#7]=[#6](/[#7])-[#7])-[#6](=O)-[#7]-[#6@@H](-[#6]-[#6](-[#7])=O)-[#6](=O)-[#7]-[#6@@H](-[#6]-[#6]-[#6](-[#7])=O)-[#6](-[#8])=O |r|
Show InChI InChI=1S/C82H137N31O22/c1-44(101-63(119)42-100-78(133)65(46(3)115)113-76(131)57(38-48-21-8-5-9-22-48)103-64(120)41-98-62(118)40-99-68(123)49(86)37-47-19-6-4-7-20-47)66(121)104-53(26-16-34-95-80(89)90)71(126)108-52(25-12-15-33-85)74(129)112-59(43-114)77(132)102-45(2)67(122)105-54(27-17-35-96-81(91)92)72(127)107-50(23-10-13-31-83)69(124)106-51(24-11-14-32-84)70(125)109-55(28-18-36-97-82(93)94)73(128)111-58(39-61(88)117)75(130)110-56(79(134)135)29-30-60(87)116/h4-9,19-22,44-46,49-59,65,114-115H,10-18,23-43,83-86H2,1-3H3,(H2,87,116)(H2,88,117)(H,98,118)(H,99,123)(H,100,133)(H,101,119)(H,102,132)(H,103,120)(H,104,121)(H,105,122)(H,106,124)(H,107,127)(H,108,126)(H,109,125)(H,110,130)(H,111,128)(H,112,129)(H,113,131)(H,134,135)(H4,89,90,95)(H4,91,92,96)(H4,93,94,97)/t44-,45-,46+,49-,50-,51-,52-,53-,54-,55-,56-,57-,58-,59-,65-/m0/s1
Reactome pathway
n/an/an/an/a 1.30n/an/an/an/a
TBA
Curated by ChEMBL
Assay Description
Activation of rat ORL1 receptor expressed in african green monkey COS7 cells by [35S]GTPgammaS binding assay
Bioorg Med Chem 16: 9261-7 (2008)
Article DOI: 10.1016/j.bmc.2008.09.014
BindingDB Entry DOI: 10.7270/Q2MC90XH
Nociceptin/Orphanin FQ, NOP receptor
(RAT)
BDBM50274452
(CHEMBL506825 | FGGFTGARKSARKKRNQ)
Show SMILES [#6]-[#6@@H](-[#8])-[#6@H](-[#7]-[#6](=O)-[#6@H](-[#6]-c1ccccc1)-[#7]-[#6](=O)-[#6]-[#7]-[#6](=O)-[#6]-[#7]-[#6](=O)-[#6@@H](-[#7])-[#6]-c1ccccc1)-[#6](=O)-[#7]-[#6]-[#6](=O)-[#7]-[#6@@H](-[#6])-[#6](=O)-[#7]-[#6@@H](-[#6]-[#6]-[#6]\[#7]=[#6](/[#7])-[#7])-[#6](=O)-[#7]-[#6@@H](-[#6]-[#6]-[#6]-[#6]-[#7])-[#6](=O)-[#7]-[#6@@H](-[#6]-[#8])-[#6](=O)-[#7]-[#6@@H](-[#6])-[#6](=O)-[#7]-[#6@@H](-[#6]-[#6]-[#6]\[#7]=[#6](/[#7])-[#7])-[#6](=O)-[#7]-[#6@@H](-[#6]-[#6]-[#6]-[#6]-[#7])-[#6](=O)-[#7]-[#6@@H](-[#6]-[#6]-[#6]-[#6]-[#7])-[#6](=O)-[#7]-[#6@@H](-[#6]-[#6]-[#6]\[#7]=[#6](/[#7])-[#7])-[#6](=O)-[#7]-[#6@@H](-[#6]-[#6](-[#7])=O)-[#6](=O)-[#7]-[#6@@H](-[#6]-[#6]-[#6](-[#7])=O)-[#6](-[#8])=O |r|
Show InChI InChI=1S/C82H137N31O22/c1-44(101-63(119)42-100-78(133)65(46(3)115)113-76(131)57(38-48-21-8-5-9-22-48)103-64(120)41-98-62(118)40-99-68(123)49(86)37-47-19-6-4-7-20-47)66(121)104-53(26-16-34-95-80(89)90)71(126)108-52(25-12-15-33-85)74(129)112-59(43-114)77(132)102-45(2)67(122)105-54(27-17-35-96-81(91)92)72(127)107-50(23-10-13-31-83)69(124)106-51(24-11-14-32-84)70(125)109-55(28-18-36-97-82(93)94)73(128)111-58(39-61(88)117)75(130)110-56(79(134)135)29-30-60(87)116/h4-9,19-22,44-46,49-59,65,114-115H,10-18,23-43,83-86H2,1-3H3,(H2,87,116)(H2,88,117)(H,98,118)(H,99,123)(H,100,133)(H,101,119)(H,102,132)(H,103,120)(H,104,121)(H,105,122)(H,106,124)(H,107,127)(H,108,126)(H,109,125)(H,110,130)(H,111,128)(H,112,129)(H,113,131)(H,134,135)(H4,89,90,95)(H4,91,92,96)(H4,93,94,97)/t44-,45-,46+,49-,50-,51-,52-,53-,54-,55-,56-,57-,58-,59-,65-/m0/s1
Reactome pathway
n/an/a 0.210n/an/an/an/an/an/a
TBA
Curated by ChEMBL
Assay Description
Displacement of [3H]nociceptin from rat ORL1 receptor expressed in african green monkey COS7 cells
Bioorg Med Chem 16: 9261-7 (2008)
Article DOI: 10.1016/j.bmc.2008.09.014
BindingDB Entry DOI: 10.7270/Q2MC90XH