BDBM50274454 CHEMBL511107::FGGFTGARKSARKKKNQ
SMILES: [#6]-[#6@@H](-[#8])-[#6@H](-[#7]-[#6](=O)-[#6@H](-[#6]-c1ccccc1)-[#7]-[#6](=O)-[#6]-[#7]-[#6](=O)-[#6]-[#7]-[#6](=O)-[#6@@H](-[#7])-[#6]-c1ccccc1)-[#6](=O)-[#7]-[#6]-[#6](=O)-[#7]-[#6@@H](-[#6])-[#6](=O)-[#7]-[#6@@H](-[#6]-[#6]-[#6]\[#7]=[#6](/[#7])-[#7])-[#6](=O)-[#7]-[#6@@H](-[#6]-[#6]-[#6]-[#6]-[#7])-[#6](=O)-[#7]-[#6@@H](-[#6]-[#8])-[#6](=O)-[#7]-[#6@@H](-[#6])-[#6](=O)-[#7]-[#6@@H](-[#6]-[#6]-[#6]\[#7]=[#6](/[#7])-[#7])-[#6](=O)-[#7]-[#6@@H](-[#6]-[#6]-[#6]-[#6]-[#7])-[#6](=O)-[#7]-[#6@@H](-[#6]-[#6]-[#6]-[#6]-[#7])-[#6](=O)-[#7]-[#6@@H](-[#6]-[#6]-[#6]-[#6]-[#7])-[#6](=O)-[#7]-[#6@@H](-[#6]-[#6](-[#7])=O)-[#6](=O)-[#7]-[#6@@H](-[#6]-[#6]-[#6](-[#7])=O)-[#6](-[#8])=O
InChI Key: InChIKey=UDQRAMWZBFAZAV-WBMOPDPASA-N
Data: 1 IC50  1 EC50
Activity Spreadsheet -- Enzyme Inhibition Constant Data from BindingDB
Found 2 hits for monomerid = 50274454
Trg + Lig
Ki
nM
ΔG°
kcal/mole
IC50
nM
Kd
nM
EC50/IC50
nM
koff
s-1
kon
M-1s-1
pHTemp
°C
Nociceptin/Orphanin FQ, NOP receptor
(RAT)
BDBM50274454
(CHEMBL511107 | FGGFTGARKSARKKKNQ)
Show SMILES [#6]-[#6@@H](-[#8])-[#6@H](-[#7]-[#6](=O)-[#6@H](-[#6]-c1ccccc1)-[#7]-[#6](=O)-[#6]-[#7]-[#6](=O)-[#6]-[#7]-[#6](=O)-[#6@@H](-[#7])-[#6]-c1ccccc1)-[#6](=O)-[#7]-[#6]-[#6](=O)-[#7]-[#6@@H](-[#6])-[#6](=O)-[#7]-[#6@@H](-[#6]-[#6]-[#6]\[#7]=[#6](/[#7])-[#7])-[#6](=O)-[#7]-[#6@@H](-[#6]-[#6]-[#6]-[#6]-[#7])-[#6](=O)-[#7]-[#6@@H](-[#6]-[#8])-[#6](=O)-[#7]-[#6@@H](-[#6])-[#6](=O)-[#7]-[#6@@H](-[#6]-[#6]-[#6]\[#7]=[#6](/[#7])-[#7])-[#6](=O)-[#7]-[#6@@H](-[#6]-[#6]-[#6]-[#6]-[#7])-[#6](=O)-[#7]-[#6@@H](-[#6]-[#6]-[#6]-[#6]-[#7])-[#6](=O)-[#7]-[#6@@H](-[#6]-[#6]-[#6]-[#6]-[#7])-[#6](=O)-[#7]-[#6@@H](-[#6]-[#6](-[#7])=O)-[#6](=O)-[#7]-[#6@@H](-[#6]-[#6]-[#6](-[#7])=O)-[#6](-[#8])=O |r|
Show InChI InChI=1S/C82H137N29O22/c1-45(99-64(117)43-98-79(131)66(47(3)113)111-77(129)58(39-49-22-8-5-9-23-49)101-65(118)42-96-63(116)41-97-69(121)50(87)38-48-20-6-4-7-21-48)67(119)102-55(28-18-36-94-81(90)91)72(124)107-54(27-13-17-35-86)75(127)110-60(44-112)78(130)100-46(2)68(120)103-56(29-19-37-95-82(92)93)73(125)105-52(25-11-15-33-84)70(122)104-51(24-10-14-32-83)71(123)106-53(26-12-16-34-85)74(126)109-59(40-62(89)115)76(128)108-57(80(132)133)30-31-61(88)114/h4-9,20-23,45-47,50-60,66,112-113H,10-19,24-44,83-87H2,1-3H3,(H2,88,114)(H2,89,115)(H,96,116)(H,97,121)(H,98,131)(H,99,117)(H,100,130)(H,101,118)(H,102,119)(H,103,120)(H,104,122)(H,105,125)(H,106,123)(H,107,124)(H,108,128)(H,109,126)(H,110,127)(H,111,129)(H,132,133)(H4,90,91,94)(H4,92,93,95)/t45-,46-,47+,50-,51-,52-,53-,54-,55-,56-,57-,58-,59-,60-,66-/m0/s1
Reactome pathway
n/an/an/an/a 1.10n/an/an/an/a
TBA
Curated by ChEMBL
Assay Description
Activation of rat ORL1 receptor expressed in african green monkey COS7 cells by [35S]GTPgammaS binding assay
Bioorg Med Chem 16: 9261-7 (2008)
Article DOI: 10.1016/j.bmc.2008.09.014
BindingDB Entry DOI: 10.7270/Q2MC90XH
Nociceptin/Orphanin FQ, NOP receptor
(RAT)
BDBM50274454
(CHEMBL511107 | FGGFTGARKSARKKKNQ)
Show SMILES [#6]-[#6@@H](-[#8])-[#6@H](-[#7]-[#6](=O)-[#6@H](-[#6]-c1ccccc1)-[#7]-[#6](=O)-[#6]-[#7]-[#6](=O)-[#6]-[#7]-[#6](=O)-[#6@@H](-[#7])-[#6]-c1ccccc1)-[#6](=O)-[#7]-[#6]-[#6](=O)-[#7]-[#6@@H](-[#6])-[#6](=O)-[#7]-[#6@@H](-[#6]-[#6]-[#6]\[#7]=[#6](/[#7])-[#7])-[#6](=O)-[#7]-[#6@@H](-[#6]-[#6]-[#6]-[#6]-[#7])-[#6](=O)-[#7]-[#6@@H](-[#6]-[#8])-[#6](=O)-[#7]-[#6@@H](-[#6])-[#6](=O)-[#7]-[#6@@H](-[#6]-[#6]-[#6]\[#7]=[#6](/[#7])-[#7])-[#6](=O)-[#7]-[#6@@H](-[#6]-[#6]-[#6]-[#6]-[#7])-[#6](=O)-[#7]-[#6@@H](-[#6]-[#6]-[#6]-[#6]-[#7])-[#6](=O)-[#7]-[#6@@H](-[#6]-[#6]-[#6]-[#6]-[#7])-[#6](=O)-[#7]-[#6@@H](-[#6]-[#6](-[#7])=O)-[#6](=O)-[#7]-[#6@@H](-[#6]-[#6]-[#6](-[#7])=O)-[#6](-[#8])=O |r|
Show InChI InChI=1S/C82H137N29O22/c1-45(99-64(117)43-98-79(131)66(47(3)113)111-77(129)58(39-49-22-8-5-9-23-49)101-65(118)42-96-63(116)41-97-69(121)50(87)38-48-20-6-4-7-21-48)67(119)102-55(28-18-36-94-81(90)91)72(124)107-54(27-13-17-35-86)75(127)110-60(44-112)78(130)100-46(2)68(120)103-56(29-19-37-95-82(92)93)73(125)105-52(25-11-15-33-84)70(122)104-51(24-10-14-32-83)71(123)106-53(26-12-16-34-85)74(126)109-59(40-62(89)115)76(128)108-57(80(132)133)30-31-61(88)114/h4-9,20-23,45-47,50-60,66,112-113H,10-19,24-44,83-87H2,1-3H3,(H2,88,114)(H2,89,115)(H,96,116)(H,97,121)(H,98,131)(H,99,117)(H,100,130)(H,101,118)(H,102,119)(H,103,120)(H,104,122)(H,105,125)(H,106,123)(H,107,124)(H,108,128)(H,109,126)(H,110,127)(H,111,129)(H,132,133)(H4,90,91,94)(H4,92,93,95)/t45-,46-,47+,50-,51-,52-,53-,54-,55-,56-,57-,58-,59-,60-,66-/m0/s1
Reactome pathway
n/an/a 0.160n/an/an/an/an/an/a
TBA
Curated by ChEMBL
Assay Description
Displacement of [3H]nociceptin from rat ORL1 receptor expressed in african green monkey COS7 cells
Bioorg Med Chem 16: 9261-7 (2008)
Article DOI: 10.1016/j.bmc.2008.09.014
BindingDB Entry DOI: 10.7270/Q2MC90XH