BDBM50274455 CHEMBL500773::FGGFTGARKSARKRANQ
SMILES: [#6]-[#6@@H](-[#8])-[#6@H](-[#7]-[#6](=O)-[#6@H](-[#6]-c1ccccc1)-[#7]-[#6](=O)-[#6]-[#7]-[#6](=O)-[#6]-[#7]-[#6](=O)-[#6@@H](-[#7])-[#6]-c1ccccc1)-[#6](=O)-[#7]-[#6]-[#6](=O)-[#7]-[#6@@H](-[#6])-[#6](=O)-[#7]-[#6@@H](-[#6]-[#6]-[#6]\[#7]=[#6](/[#7])-[#7])-[#6](=O)-[#7]-[#6@@H](-[#6]-[#6]-[#6]-[#6]-[#7])-[#6](=O)-[#7]-[#6@@H](-[#6]-[#8])-[#6](=O)-[#7]-[#6@@H](-[#6])-[#6](=O)-[#7]-[#6@@H](-[#6]-[#6]-[#6]\[#7]=[#6](/[#7])-[#7])-[#6](=O)-[#7]-[#6@@H](-[#6]-[#6]-[#6]-[#6]-[#7])-[#6](=O)-[#7]-[#6@@H](-[#6]-[#6]-[#6]\[#7]=[#6](/[#7])-[#7])-[#6](=O)-[#7]-[#6@@H](-[#6])-[#6](=O)-[#7]-[#6@@H](-[#6]-[#6](-[#7])=O)-[#6](=O)-[#7]-[#6@@H](-[#6]-[#6]-[#6](-[#7])=O)-[#6](-[#8])=O
InChI Key: InChIKey=YTLZMPJDUFYROB-YRFUXTPFSA-N
Data: 1 IC50  1 EC50
Activity Spreadsheet -- Enzyme Inhibition Constant Data from BindingDB
Found 2 hits for monomerid = 50274455
Trg + Lig
Ki
nM
ΔG°
kcal/mole
IC50
nM
Kd
nM
EC50/IC50
nM
koff
s-1
kon
M-1s-1
pHTemp
°C
Nociceptin/Orphanin FQ, NOP receptor
(RAT)
BDBM50274455
(CHEMBL500773 | FGGFTGARKSARKRANQ)
Show SMILES [#6]-[#6@@H](-[#8])-[#6@H](-[#7]-[#6](=O)-[#6@H](-[#6]-c1ccccc1)-[#7]-[#6](=O)-[#6]-[#7]-[#6](=O)-[#6]-[#7]-[#6](=O)-[#6@@H](-[#7])-[#6]-c1ccccc1)-[#6](=O)-[#7]-[#6]-[#6](=O)-[#7]-[#6@@H](-[#6])-[#6](=O)-[#7]-[#6@@H](-[#6]-[#6]-[#6]\[#7]=[#6](/[#7])-[#7])-[#6](=O)-[#7]-[#6@@H](-[#6]-[#6]-[#6]-[#6]-[#7])-[#6](=O)-[#7]-[#6@@H](-[#6]-[#8])-[#6](=O)-[#7]-[#6@@H](-[#6])-[#6](=O)-[#7]-[#6@@H](-[#6]-[#6]-[#6]\[#7]=[#6](/[#7])-[#7])-[#6](=O)-[#7]-[#6@@H](-[#6]-[#6]-[#6]-[#6]-[#7])-[#6](=O)-[#7]-[#6@@H](-[#6]-[#6]-[#6]\[#7]=[#6](/[#7])-[#7])-[#6](=O)-[#7]-[#6@@H](-[#6])-[#6](=O)-[#7]-[#6@@H](-[#6]-[#6](-[#7])=O)-[#6](=O)-[#7]-[#6@@H](-[#6]-[#6]-[#6](-[#7])=O)-[#6](-[#8])=O |r|
Show InChI InChI=1S/C79H130N30O22/c1-41(97-60(115)39-96-75(129)62(44(4)111)109-73(127)54(35-46-20-9-6-10-21-46)100-61(116)38-94-59(114)37-95-66(120)47(82)34-45-18-7-5-8-19-45)63(117)101-51(25-16-32-92-78(87)88)69(123)104-49(23-12-14-30-81)71(125)108-56(40-110)74(128)99-42(2)64(118)102-52(26-17-33-93-79(89)90)70(124)103-48(22-11-13-29-80)68(122)105-50(24-15-31-91-77(85)86)67(121)98-43(3)65(119)107-55(36-58(84)113)72(126)106-53(76(130)131)27-28-57(83)112/h5-10,18-21,41-44,47-56,62,110-111H,11-17,22-40,80-82H2,1-4H3,(H2,83,112)(H2,84,113)(H,94,114)(H,95,120)(H,96,129)(H,97,115)(H,98,121)(H,99,128)(H,100,116)(H,101,117)(H,102,118)(H,103,124)(H,104,123)(H,105,122)(H,106,126)(H,107,119)(H,108,125)(H,109,127)(H,130,131)(H4,85,86,91)(H4,87,88,92)(H4,89,90,93)/t41-,42-,43-,44+,47-,48-,49-,50-,51-,52-,53-,54-,55-,56-,62-/m0/s1
Reactome pathway
n/an/an/an/a 4n/an/an/an/a
TBA
Curated by ChEMBL
Assay Description
Activation of rat ORL1 receptor expressed in african green monkey COS7 cells by [35S]GTPgammaS binding assay
Bioorg Med Chem 16: 9261-7 (2008)
Article DOI: 10.1016/j.bmc.2008.09.014
BindingDB Entry DOI: 10.7270/Q2MC90XH
Nociceptin/Orphanin FQ, NOP receptor
(RAT)
BDBM50274455
(CHEMBL500773 | FGGFTGARKSARKRANQ)
Show SMILES [#6]-[#6@@H](-[#8])-[#6@H](-[#7]-[#6](=O)-[#6@H](-[#6]-c1ccccc1)-[#7]-[#6](=O)-[#6]-[#7]-[#6](=O)-[#6]-[#7]-[#6](=O)-[#6@@H](-[#7])-[#6]-c1ccccc1)-[#6](=O)-[#7]-[#6]-[#6](=O)-[#7]-[#6@@H](-[#6])-[#6](=O)-[#7]-[#6@@H](-[#6]-[#6]-[#6]\[#7]=[#6](/[#7])-[#7])-[#6](=O)-[#7]-[#6@@H](-[#6]-[#6]-[#6]-[#6]-[#7])-[#6](=O)-[#7]-[#6@@H](-[#6]-[#8])-[#6](=O)-[#7]-[#6@@H](-[#6])-[#6](=O)-[#7]-[#6@@H](-[#6]-[#6]-[#6]\[#7]=[#6](/[#7])-[#7])-[#6](=O)-[#7]-[#6@@H](-[#6]-[#6]-[#6]-[#6]-[#7])-[#6](=O)-[#7]-[#6@@H](-[#6]-[#6]-[#6]\[#7]=[#6](/[#7])-[#7])-[#6](=O)-[#7]-[#6@@H](-[#6])-[#6](=O)-[#7]-[#6@@H](-[#6]-[#6](-[#7])=O)-[#6](=O)-[#7]-[#6@@H](-[#6]-[#6]-[#6](-[#7])=O)-[#6](-[#8])=O |r|
Show InChI InChI=1S/C79H130N30O22/c1-41(97-60(115)39-96-75(129)62(44(4)111)109-73(127)54(35-46-20-9-6-10-21-46)100-61(116)38-94-59(114)37-95-66(120)47(82)34-45-18-7-5-8-19-45)63(117)101-51(25-16-32-92-78(87)88)69(123)104-49(23-12-14-30-81)71(125)108-56(40-110)74(128)99-42(2)64(118)102-52(26-17-33-93-79(89)90)70(124)103-48(22-11-13-29-80)68(122)105-50(24-15-31-91-77(85)86)67(121)98-43(3)65(119)107-55(36-58(84)113)72(126)106-53(76(130)131)27-28-57(83)112/h5-10,18-21,41-44,47-56,62,110-111H,11-17,22-40,80-82H2,1-4H3,(H2,83,112)(H2,84,113)(H,94,114)(H,95,120)(H,96,129)(H,97,115)(H,98,121)(H,99,128)(H,100,116)(H,101,117)(H,102,118)(H,103,124)(H,104,123)(H,105,122)(H,106,126)(H,107,119)(H,108,125)(H,109,127)(H,130,131)(H4,85,86,91)(H4,87,88,92)(H4,89,90,93)/t41-,42-,43-,44+,47-,48-,49-,50-,51-,52-,53-,54-,55-,56-,62-/m0/s1
Reactome pathway
n/an/a 0.330n/an/an/an/an/an/a
TBA
Curated by ChEMBL
Assay Description
Displacement of [3H]nociceptin from rat ORL1 receptor expressed in african green monkey COS7 cells
Bioorg Med Chem 16: 9261-7 (2008)
Article DOI: 10.1016/j.bmc.2008.09.014
BindingDB Entry DOI: 10.7270/Q2MC90XH