BDBM50274557 4-cyano-N-(1-isopropyl-5-(N-methylcyclohexanecarboxamido)-1H-benzo[d]imidazol-2-yl)benzamide::CHEMBL484395
SMILES: CC(C)n1c(NC(=O)c2ccc(cc2)C#N)nc2cc(ccc12)N(C)C(=O)C1CCCCC1
InChI Key: InChIKey=LDQNVCYEEQUVKB-UHFFFAOYSA-N
Data: 1 IC50
Activity Spreadsheet -- Enzyme Inhibition Constant Data from BindingDB
Found 1 hit for monomerid = 50274557
Trg + Lig
Ki
nM
ΔG°
kcal/mole
IC50
nM
Kd
nM
EC50/IC50
nM
koff
s-1
kon
M-1s-1
pHTemp
°C
Tyrosine-protein kinase ITK/TSK
(Homo sapiens (Human))
BDBM50274557
(4-cyano-N-(1-isopropyl-5-(N-methylcyclohexanecarbo...)
Show SMILES CC(C)n1c(NC(=O)c2ccc(cc2)C#N)nc2cc(ccc12)N(C)C(=O)C1CCCCC1
Show InChI InChI=1S/C26H29N5O2/c1-17(2)31-23-14-13-21(30(3)25(33)20-7-5-4-6-8-20)15-22(23)28-26(31)29-24(32)19-11-9-18(16-27)10-12-19/h9-15,17,20H,4-8H2,1-3H3,(H,28,29,32)
Reactome pathway
n/an/a 35n/an/an/an/an/an/a
Johnson & Johnson
Curated by ChEMBL
Assay Description
Inhibition of ITK by DELFIA assay
Bioorg Med Chem Lett 18: 5545-9 (2008)
Article DOI: 10.1016/j.bmcl.2008.09.015
BindingDB Entry DOI: 10.7270/Q2M32VMD