BDBM50274632 4-cyano-N-(1-(3-(dimethylamino)-3-oxopropyl)-5-(N-methylcyclohexanecarboxamido)-1H-benzo[d]imidazol-2-yl)benzamide::CHEMBL483764
SMILES: CN(C)C(=O)CCn1c(NC(=O)c2ccc(cc2)C#N)nc2cc(ccc12)N(C)C(=O)C1CCCCC1
InChI Key: InChIKey=FMNPVVIUHASJEU-UHFFFAOYSA-N
Data: 1 IC50
Activity Spreadsheet -- Enzyme Inhibition Constant Data from BindingDB
Found 1 hit for monomerid = 50274632
Trg + Lig
Ki
nM
ΔG°
kcal/mole
IC50
nM
Kd
nM
EC50/IC50
nM
koff
s-1
kon
M-1s-1
pHTemp
°C
Tyrosine-protein kinase ITK/TSK
(Homo sapiens (Human))
BDBM50274632
(4-cyano-N-(1-(3-(dimethylamino)-3-oxopropyl)-5-(N-...)
Show SMILES CN(C)C(=O)CCn1c(NC(=O)c2ccc(cc2)C#N)nc2cc(ccc12)N(C)C(=O)C1CCCCC1
Show InChI InChI=1S/C28H32N6O3/c1-32(2)25(35)15-16-34-24-14-13-22(33(3)27(37)21-7-5-4-6-8-21)17-23(24)30-28(34)31-26(36)20-11-9-19(18-29)10-12-20/h9-14,17,21H,4-8,15-16H2,1-3H3,(H,30,31,36)
Reactome pathway
n/an/a 14n/an/an/an/an/an/a
Johnson & Johnson
Curated by ChEMBL
Assay Description
Inhibition of ITK by DELFIA assay
Bioorg Med Chem Lett 18: 5545-9 (2008)
Article DOI: 10.1016/j.bmcl.2008.09.015
BindingDB Entry DOI: 10.7270/Q2M32VMD