BDBM50274745 4-(1-ethyl-2-methyl-1H-imidazol-5-yl)-N-(4-(methylsulfonyl)phenyl)pyrimidin-2-amine::CHEMBL514913
SMILES: CCn1c(C)ncc1-c1ccnc(Nc2ccc(cc2)S(C)(=O)=O)n1
InChI Key: InChIKey=PVCKGYNFGXACAQ-UHFFFAOYSA-N
Data: 1 IC50
Activity Spreadsheet -- Enzyme Inhibition Constant Data from BindingDB
Found 1 hit for monomerid = 50274745
Trg + Lig
Ki
nM
ΔG°
kcal/mole
IC50
nM
Kd
nM
EC50/IC50
nM
koff
s-1
kon
M-1s-1
pHTemp
°C
Cyclin-dependent kinase 2
(Homo sapiens (Human))
BDBM50274745
(4-(1-ethyl-2-methyl-1H-imidazol-5-yl)-N-(4-(methyl...)
Show SMILES CCn1c(C)ncc1-c1ccnc(Nc2ccc(cc2)S(C)(=O)=O)n1
Show InChI InChI=1S/C17H19N5O2S/c1-4-22-12(2)19-11-16(22)15-9-10-18-17(21-15)20-13-5-7-14(8-6-13)25(3,23)24/h5-11H,4H2,1-3H3,(H,18,20,21)
NCI pathway
Reactome pathway
n/an/a 23n/an/an/an/an/an/a
AstraZeneca
Curated by ChEMBL
Assay Description
Inhibition of CDK2
Bioorg Med Chem Lett 18: 5487-92 (2008)
Article DOI: 10.1016/j.bmcl.2008.09.024
BindingDB Entry DOI: 10.7270/Q2J9667K