BDBM50274755 CHEMBL458973::cis-5-(2-Aminocyclohexylamino)-7-(3,5-difluorophenylamino)imidazo[1,2-c]pyrimidine-8-carboxamide
SMILES: N[C@@H]1CCCC[C@@H]1Nc1nc(Nc2cc(F)cc(F)c2)c(C(N)=O)c2nccn12
InChI Key: InChIKey=WTBBLBQFQMOQBJ-KGLIPLIRSA-N
Data: 2 IC50
Activity Spreadsheet -- Enzyme Inhibition Constant Data from BindingDB
Found 2 hits for monomerid = 50274755
Trg + Lig
Ki
nM
ΔG°
kcal/mole
IC50
nM
Kd
nM
EC50/IC50
nM
koff
s-1
kon
M-1s-1
pHTemp
°C
Tyrosine-protein kinase ZAP-70
(Homo sapiens (Human))
BDBM50274755
(CHEMBL458973 | cis-5-(2-Aminocyclohexylamino)-7-(3...)
Show SMILES N[C@@H]1CCCC[C@@H]1Nc1nc(Nc2cc(F)cc(F)c2)c(C(N)=O)c2nccn12 |r|
Show InChI InChI=1S/C19H21F2N7O/c20-10-7-11(21)9-12(8-10)25-17-15(16(23)29)18-24-5-6-28(18)19(27-17)26-14-4-2-1-3-13(14)22/h5-9,13-14,25H,1-4,22H2,(H2,23,29)(H,26,27)/t13-,14+/m1/s1
NCI pathway
Reactome pathway
n/an/a 730n/an/an/an/an/an/a
Kissei Pharmaceutical Company Ltd
Curated by ChEMBL
Assay Description
Inhibition of human ZAP70 expressed in Sf9 cells
Bioorg Med Chem 16: 9247-60 (2008)
Article DOI: 10.1016/j.bmc.2008.09.015
BindingDB Entry DOI: 10.7270/Q2GM887N
Tyrosine-protein kinase SYK
(Homo sapiens (Human))
BDBM50274755
(CHEMBL458973 | cis-5-(2-Aminocyclohexylamino)-7-(3...)
Show SMILES N[C@@H]1CCCC[C@@H]1Nc1nc(Nc2cc(F)cc(F)c2)c(C(N)=O)c2nccn12 |r|
Show InChI InChI=1S/C19H21F2N7O/c20-10-7-11(21)9-12(8-10)25-17-15(16(23)29)18-24-5-6-28(18)19(27-17)26-14-4-2-1-3-13(14)22/h5-9,13-14,25H,1-4,22H2,(H2,23,29)(H,26,27)/t13-,14+/m1/s1
NCI pathway
Reactome pathway
n/an/a 30n/an/an/an/an/an/a
Kissei Pharmaceutical Company Ltd
Curated by ChEMBL
Assay Description
Inhibition of human Syk expressed in Sf9 cells
Bioorg Med Chem 16: 9247-60 (2008)
Article DOI: 10.1016/j.bmc.2008.09.015
BindingDB Entry DOI: 10.7270/Q2GM887N