BDBM50274921 5-(3-(4-fluorobenzyl)pyrrolidin-3-yl)-1H-indole::CHEMBL513258
SMILES: Fc1ccc(CC2(CCNC2)c2ccc3[nH]ccc3c2)cc1
InChI Key: InChIKey=RBNFIIOAQFISLC-UHFFFAOYSA-N
Data: 3 KI  2 IC50
Activity Spreadsheet -- Enzyme Inhibition Constant Data from BindingDB
Found 5 hits for monomerid = 50274921
Trg + Lig
Ki
nM
ΔG°
kcal/mole
IC50
nM
Kd
nM
EC50/IC50
nM
koff
s-1
kon
M-1s-1
pHTemp
°C
Sodium-dependent noradrenaline transporter
(Homo sapiens (Human))
BDBM50274921
(5-(3-(4-fluorobenzyl)pyrrolidin-3-yl)-1H-indole | ...)
Show SMILES Fc1ccc(CC2(CCNC2)c2ccc3[nH]ccc3c2)cc1
Show InChI InChI=1S/C19H19FN2/c20-17-4-1-14(2-5-17)12-19(8-10-21-13-19)16-3-6-18-15(11-16)7-9-22-18/h1-7,9,11,21-22H,8,10,12-13H2
Reactome pathway
7n/an/an/an/an/an/an/an/a
Roche Palo Alto LLC
Curated by ChEMBL
Assay Description
Inhibition of NET (unknown origin)
Bioorg Med Chem Lett 18: 6062-6 (2008)
Article DOI: 10.1016/j.bmcl.2008.10.025
BindingDB Entry DOI: 10.7270/Q29886TF
Sodium-dependent serotonin transporter
(Homo sapiens (Human))
BDBM50274921
(5-(3-(4-fluorobenzyl)pyrrolidin-3-yl)-1H-indole | ...)
Show SMILES Fc1ccc(CC2(CCNC2)c2ccc3[nH]ccc3c2)cc1
Show InChI InChI=1S/C19H19FN2/c20-17-4-1-14(2-5-17)12-19(8-10-21-13-19)16-3-6-18-15(11-16)7-9-22-18/h1-7,9,11,21-22H,8,10,12-13H2
15n/an/an/an/an/an/an/an/a
Roche Palo Alto LLC
Curated by ChEMBL
Assay Description
Inhibition of SERT (unknown origin)
Bioorg Med Chem Lett 18: 6062-6 (2008)
Article DOI: 10.1016/j.bmcl.2008.10.025
BindingDB Entry DOI: 10.7270/Q29886TF
Sodium-dependent dopamine transporter
(Homo sapiens (Human))
BDBM50274921
(5-(3-(4-fluorobenzyl)pyrrolidin-3-yl)-1H-indole | ...)
Show SMILES Fc1ccc(CC2(CCNC2)c2ccc3[nH]ccc3c2)cc1
Show InChI InChI=1S/C19H19FN2/c20-17-4-1-14(2-5-17)12-19(8-10-21-13-19)16-3-6-18-15(11-16)7-9-22-18/h1-7,9,11,21-22H,8,10,12-13H2
NCI pathway
Reactome pathway
79n/an/an/an/an/an/an/an/a
Roche Palo Alto LLC
Curated by ChEMBL
Assay Description
Inhibition of DAT (unknown origin)
Bioorg Med Chem Lett 18: 6062-6 (2008)
Article DOI: 10.1016/j.bmcl.2008.10.025
BindingDB Entry DOI: 10.7270/Q29886TF
Cytochrome P450 2D6
(Homo sapiens (Human))
BDBM50274921
(5-(3-(4-fluorobenzyl)pyrrolidin-3-yl)-1H-indole | ...)
Show SMILES Fc1ccc(CC2(CCNC2)c2ccc3[nH]ccc3c2)cc1
Show InChI InChI=1S/C19H19FN2/c20-17-4-1-14(2-5-17)12-19(8-10-21-13-19)16-3-6-18-15(11-16)7-9-22-18/h1-7,9,11,21-22H,8,10,12-13H2
n/an/a 100n/an/an/an/an/an/a
Roche Palo Alto LLC
Curated by ChEMBL
Assay Description
Inhibition of CYP2D6 (unknown origin) by fluorescence based assay
Bioorg Med Chem Lett 18: 6062-6 (2008)
Article DOI: 10.1016/j.bmcl.2008.10.025
BindingDB Entry DOI: 10.7270/Q29886TF
Potassium voltage-gated channel subfamily H member 2
(Homo sapiens (Human))
BDBM50274921
(5-(3-(4-fluorobenzyl)pyrrolidin-3-yl)-1H-indole | ...)
Show SMILES Fc1ccc(CC2(CCNC2)c2ccc3[nH]ccc3c2)cc1
Show InChI InChI=1S/C19H19FN2/c20-17-4-1-14(2-5-17)12-19(8-10-21-13-19)16-3-6-18-15(11-16)7-9-22-18/h1-7,9,11,21-22H,8,10,12-13H2
Reactome pathway
n/an/a 9.00E+3n/an/an/an/an/an/a
Roche Palo Alto LLC
Curated by ChEMBL
Assay Description
Inhibition of human ERG expressed in CHO cells
Bioorg Med Chem Lett 18: 6062-6 (2008)
Article DOI: 10.1016/j.bmcl.2008.10.025
BindingDB Entry DOI: 10.7270/Q29886TF