BDBM50275611 (S)-1-methyl-N-(1-(4-methyl-5-phenyl-1H-imidazol-2-yl)-7-oxooctyl)piperidine-4-carboxamide::CHEMBL488188
SMILES: CN1CCC(CC1)C(=O)N[C@@H](CCCCCC(C)=O)c1nc(c(C)[nH]1)-c1ccccc1
InChI Key: InChIKey=XTAZADVDKLCIPI-QFIPXVFZSA-N
Data: 1 IC50
Activity Spreadsheet -- Enzyme Inhibition Constant Data from BindingDB
Found 1 hit for monomerid = 50275611
Trg + Lig
Ki
nM
ΔG°
kcal/mole
IC50
nM
Kd
nM
EC50/IC50
nM
koff
s-1
kon
M-1s-1
pHTemp
°C
Histone deacetylase 1
(Homo sapiens (Human))
BDBM50275611
((S)-1-methyl-N-(1-(4-methyl-5-phenyl-1H-imidazol-2...)
Show SMILES CN1CCC(CC1)C(=O)N[C@@H](CCCCCC(C)=O)c1nc(c(C)[nH]1)-c1ccccc1 |r|
Show InChI InChI=1S/C25H36N4O2/c1-18(30)10-6-4-9-13-22(27-25(31)21-14-16-29(3)17-15-21)24-26-19(2)23(28-24)20-11-7-5-8-12-20/h5,7-8,11-12,21-22H,4,6,9-10,13-17H2,1-3H3,(H,26,28)(H,27,31)/t22-/m0/s1
NCI pathway
Reactome pathway
n/an/a>1.50E+3n/an/an/an/an/an/a
IRBM/Merck Research Laboratories
Curated by ChEMBL
Assay Description
Inhibition of human recombinant C-terminally flag tagged HDAC1
Bioorg Med Chem Lett 18: 5528-32 (2008)
Article DOI: 10.1016/j.bmcl.2008.09.003
BindingDB Entry DOI: 10.7270/Q24T6K81