BDBM50275831 2-[(1R,2R)-2-(Aminomethyl)-1-(2-thienyl)cyclopropanecarbonyl] isoindoline::CHEMBL471211
SMILES: NC[C@@H]1C[C@@]1(C(=O)N1Cc2ccccc2C1)c1cccs1
InChI Key: InChIKey=ASCGGWXVCATSKL-YOEHRIQHSA-N
Data: 6 IC50
Activity Spreadsheet -- Enzyme Inhibition Constant Data from BindingDB
Found 6 hits for monomerid = 50275831
Trg + Lig
Ki
nM
ΔG°
kcal/mole
IC50
nM
Kd
nM
EC50/IC50
nM
koff
s-1
kon
M-1s-1
pHTemp
°C
Sodium-dependent serotonin transporter
(Homo sapiens (Human))
BDBM50275831
(2-[(1R,2R)-2-(Aminomethyl)-1-(2-thienyl)cyclopropa...)
Show SMILES NC[C@@H]1C[C@@]1(C(=O)N1Cc2ccccc2C1)c1cccs1 |r|
Show InChI InChI=1S/C17H18N2OS/c18-9-14-8-17(14,15-6-3-7-21-15)16(20)19-10-12-4-1-2-5-13(12)11-19/h1-7,14H,8-11,18H2/t14-,17-/m0/s1
n/an/a 13n/an/an/an/an/an/a
Neurocrine Biosciences, Inc.
Curated by ChEMBL
Assay Description
Displacement of [alpha,beta-3H(N)]-5-hydroxytryptamine from human cloned SERT expressed in HEK293 cells by microplate scintillation counter
J Med Chem 51: 7265-72 (2009)
Article DOI: 10.1021/jm8009537
BindingDB Entry DOI: 10.7270/Q2H41SCG
Transporter
(Rattus norvegicus (rat))
BDBM50275831
(2-[(1R,2R)-2-(Aminomethyl)-1-(2-thienyl)cyclopropa...)
Show SMILES NC[C@@H]1C[C@@]1(C(=O)N1Cc2ccccc2C1)c1cccs1 |r|
Show InChI InChI=1S/C17H18N2OS/c18-9-14-8-17(14,15-6-3-7-21-15)16(20)19-10-12-4-1-2-5-13(12)11-19/h1-7,14H,8-11,18H2/t14-,17-/m0/s1
Reactome pathway
n/an/a 15n/an/an/an/an/an/a
Neurocrine Biosciences, Inc.
Curated by ChEMBL
Assay Description
Displacement of Levo[ring-2,5,6-3H]norepinephrine from rat synaptosomal NET expressed in HEK293 cells by microplate scintillation counter
J Med Chem 51: 7265-72 (2009)
Article DOI: 10.1021/jm8009537
BindingDB Entry DOI: 10.7270/Q2H41SCG
Sodium-dependent dopamine transporter
(Homo sapiens (Human))
BDBM50275831
(2-[(1R,2R)-2-(Aminomethyl)-1-(2-thienyl)cyclopropa...)
Show SMILES NC[C@@H]1C[C@@]1(C(=O)N1Cc2ccccc2C1)c1cccs1 |r|
Show InChI InChI=1S/C17H18N2OS/c18-9-14-8-17(14,15-6-3-7-21-15)16(20)19-10-12-4-1-2-5-13(12)11-19/h1-7,14H,8-11,18H2/t14-,17-/m0/s1
NCI pathway
Reactome pathway
n/an/a 5.54E+3n/an/an/an/an/an/a
Neurocrine Biosciences, Inc.
Curated by ChEMBL
Assay Description
Displacement of 3,4-[ring-2,5,6-3H]dihydroxyphenylethylamine from human cloned DAT expressed in HEK293 cells by microplate scintillation counter
J Med Chem 51: 7265-72 (2009)
Article DOI: 10.1021/jm8009537
BindingDB Entry DOI: 10.7270/Q2H41SCG
Sodium-dependent serotonin transporter
(Rattus norvegicus (rat))
BDBM50275831
(2-[(1R,2R)-2-(Aminomethyl)-1-(2-thienyl)cyclopropa...)
Show SMILES NC[C@@H]1C[C@@]1(C(=O)N1Cc2ccccc2C1)c1cccs1 |r|
Show InChI InChI=1S/C17H18N2OS/c18-9-14-8-17(14,15-6-3-7-21-15)16(20)19-10-12-4-1-2-5-13(12)11-19/h1-7,14H,8-11,18H2/t14-,17-/m0/s1
n/an/a 25n/an/an/an/an/an/a
Neurocrine Biosciences, Inc.
Curated by ChEMBL
Assay Description
Displacement of [alpha,beta-3H(N)]-5-hydroxytryptamine from rat synaptosomal SERT expressed in HEK293 cells by microplate scintillation counter
J Med Chem 51: 7265-72 (2009)
Article DOI: 10.1021/jm8009537
BindingDB Entry DOI: 10.7270/Q2H41SCG
Sodium-dependent dopamine transporter
(Rattus norvegicus (rat))
BDBM50275831
(2-[(1R,2R)-2-(Aminomethyl)-1-(2-thienyl)cyclopropa...)
Show SMILES NC[C@@H]1C[C@@]1(C(=O)N1Cc2ccccc2C1)c1cccs1 |r|
Show InChI InChI=1S/C17H18N2OS/c18-9-14-8-17(14,15-6-3-7-21-15)16(20)19-10-12-4-1-2-5-13(12)11-19/h1-7,14H,8-11,18H2/t14-,17-/m0/s1
Reactome pathway
n/an/a 2.00E+3n/an/an/an/an/an/a
Neurocrine Biosciences, Inc.
Curated by ChEMBL
Assay Description
Displacement of 3,4-[ring-2,5,6-3H]dihydroxyphenylethylamine from rat synaptosomal DAT expressed in HEK293 cells by microplate scintillation counter
J Med Chem 51: 7265-72 (2009)
Article DOI: 10.1021/jm8009537
BindingDB Entry DOI: 10.7270/Q2H41SCG
Sodium-dependent noradrenaline transporter
(Homo sapiens (Human))
BDBM50275831
(2-[(1R,2R)-2-(Aminomethyl)-1-(2-thienyl)cyclopropa...)
Show SMILES NC[C@@H]1C[C@@]1(C(=O)N1Cc2ccccc2C1)c1cccs1 |r|
Show InChI InChI=1S/C17H18N2OS/c18-9-14-8-17(14,15-6-3-7-21-15)16(20)19-10-12-4-1-2-5-13(12)11-19/h1-7,14H,8-11,18H2/t14-,17-/m0/s1
Reactome pathway
n/an/a 21n/an/an/an/an/an/a
Neurocrine Biosciences, Inc.
Curated by ChEMBL
Assay Description
Displacement of Levo[ring-2,5,6-3H]norepinephrine from human cloned NET expressed in HEK293 cells by microplate scintillation counter
J Med Chem 51: 7265-72 (2009)
Article DOI: 10.1021/jm8009537
BindingDB Entry DOI: 10.7270/Q2H41SCG