null
SMILES: Cc1cccc(C)c1C(=O)N1[C@H]2CC[C@@H]1C[C@H](C2)N1CC[C@H](C1)N(Cc1ccccc1)C(=O)C1CC1
InChI Key: InChIKey=HLJVPZZJNNJNAJ-JUDWXZBOSA-N
Activity Spreadsheet -- Enzyme Inhibition Constant Data from BindingDB
Found 1 hit for monomerid = 50276259
Trg + Lig
Ki
nM
ΔG°
kcal/mole
IC50
nM
Kd
nM
EC50/IC50
nM
koff
s-1
kon
M-1s-1
pHTemp
°C
C-C chemokine receptor type 5
(Homo sapiens (Human))
BDBM50276259
(CHEMBL481068 | exo-N-benzyl-N-((R)-1-(8-(2,6-dimet...)
Show SMILES Cc1cccc(C)c1C(=O)N1[C@H]2CC[C@@H]1C[C@H](C2)N1CC[C@H](C1)N(Cc1ccccc1)C(=O)C1CC1 |r,THB:8:10:15.16.17:12.13|
Show InChI InChI=1S/C31H39N3O2/c1-21-7-6-8-22(2)29(21)31(36)34-25-13-14-26(34)18-28(17-25)32-16-15-27(20-32)33(30(35)24-11-12-24)19-23-9-4-3-5-10-23/h3-10,24-28H,11-20H2,1-2H3/t25-,26+,27-,28-/m1/s1
n/an/a 1n/an/an/an/an/an/a
Pfizer Global Research and Development
Curated by ChEMBL
Assay Description
Antagonist activity at human recombinant CCR5 expressed in human HeLa-P4 cells assessed as inhibition of human HeLa-P4 cells binding to HIV1 gp160 ex...
Bioorg Med Chem Lett 19: 1084-8 (2009)
Article DOI: 10.1016/j.bmcl.2009.01.012
BindingDB Entry DOI: 10.7270/Q2W095SG