null
SMILES: C[C@H]1C2Cc3cc4[nH]nnc4cc3[C@@]1(C)CCN2CC1CC1
InChI Key: InChIKey=VKWYVNKUABAQRG-ABRORHJPSA-N
Activity Spreadsheet -- Enzyme Inhibition Constant Data from BindingDB
Found 4 hits for monomerid = 50277115
Trg + Lig
Ki
nM
ΔG°
kcal/mole
IC50
nM
Kd
nM
EC50/IC50
nM
koff
s-1
kon
M-1s-1
pHTemp
°C
Kappa-type opioid receptor
(Homo sapiens (Human))
BDBM50277115
((1S,16R)-13-(cyclopropylmethyl)-1,16-dimethyl-5,6,...)
Show SMILES C[C@H]1C2Cc3cc4[nH]nnc4cc3[C@@]1(C)CCN2CC1CC1 |r,TLB:11:12:1:17.16.15,18:17:1:4.12.3|
Show InChI InChI=1S/C18H24N4/c1-11-17-8-13-7-15-16(20-21-19-15)9-14(13)18(11,2)5-6-22(17)10-12-3-4-12/h7,9,11-12,17H,3-6,8,10H2,1-2H3,(H,19,20,21)/t11-,17?,18-/m0/s1
Reactome pathway
0.810n/an/an/an/an/an/an/an/a
Rensselaer Polytechnic Institute
Curated by ChEMBL
Assay Description
Agonist activity at human kappa opioid receptor expressed in CHO cells assessed as stimulation of [35S]GTPgammaS binding
Bioorg Med Chem Lett 19: 365-8 (2008)
Article DOI: 10.1016/j.bmcl.2008.11.076
BindingDB Entry DOI: 10.7270/Q2M0458C
Mu-type opioid receptor
(Homo sapiens (Human))
BDBM50277115
((1S,16R)-13-(cyclopropylmethyl)-1,16-dimethyl-5,6,...)
Show SMILES C[C@H]1C2Cc3cc4[nH]nnc4cc3[C@@]1(C)CCN2CC1CC1 |r,TLB:11:12:1:17.16.15,18:17:1:4.12.3|
Show InChI InChI=1S/C18H24N4/c1-11-17-8-13-7-15-16(20-21-19-15)9-14(13)18(11,2)5-6-22(17)10-12-3-4-12/h7,9,11-12,17H,3-6,8,10H2,1-2H3,(H,19,20,21)/t11-,17?,18-/m0/s1
NCI pathway
Reactome pathway
10n/an/an/an/an/an/an/an/a
Rensselaer Polytechnic Institute
Curated by ChEMBL
Assay Description
Agonist activity at human mu opioid receptor expressed in CHO cells assessed as stimulation of [35S]GTPgammaS binding
Bioorg Med Chem Lett 19: 365-8 (2008)
Article DOI: 10.1016/j.bmcl.2008.11.076
BindingDB Entry DOI: 10.7270/Q2M0458C
Delta-type opioid receptor
(Homo sapiens (Human))
BDBM50277115
((1S,16R)-13-(cyclopropylmethyl)-1,16-dimethyl-5,6,...)
Show SMILES C[C@H]1C2Cc3cc4[nH]nnc4cc3[C@@]1(C)CCN2CC1CC1 |r,TLB:11:12:1:17.16.15,18:17:1:4.12.3|
Show InChI InChI=1S/C18H24N4/c1-11-17-8-13-7-15-16(20-21-19-15)9-14(13)18(11,2)5-6-22(17)10-12-3-4-12/h7,9,11-12,17H,3-6,8,10H2,1-2H3,(H,19,20,21)/t11-,17?,18-/m0/s1
Reactome pathway
51n/an/an/an/an/an/an/an/a
Rensselaer Polytechnic Institute
Curated by ChEMBL
Assay Description
Displacement of [3H]Naltrindole from human delta opioid receptor expressed in CHO cells
Bioorg Med Chem Lett 19: 365-8 (2008)
Article DOI: 10.1016/j.bmcl.2008.11.076
BindingDB Entry DOI: 10.7270/Q2M0458C
Kappa-type opioid receptor
(Homo sapiens (Human))
BDBM50277115
((1S,16R)-13-(cyclopropylmethyl)-1,16-dimethyl-5,6,...)
Show SMILES C[C@H]1C2Cc3cc4[nH]nnc4cc3[C@@]1(C)CCN2CC1CC1 |r,TLB:11:12:1:17.16.15,18:17:1:4.12.3|
Show InChI InChI=1S/C18H24N4/c1-11-17-8-13-7-15-16(20-21-19-15)9-14(13)18(11,2)5-6-22(17)10-12-3-4-12/h7,9,11-12,17H,3-6,8,10H2,1-2H3,(H,19,20,21)/t11-,17?,18-/m0/s1
Reactome pathway
n/an/an/an/a 77n/an/an/an/a
Rensselaer Polytechnic Institute
Curated by ChEMBL
Assay Description
Agonist activity at human kappa opioid receptor expressed in CHO cells assessed as stimulation of [35S]GTPgammaS binding
Bioorg Med Chem Lett 19: 365-8 (2008)
Article DOI: 10.1016/j.bmcl.2008.11.076
BindingDB Entry DOI: 10.7270/Q2M0458C