null
SMILES: Cc1csc(CN[C@H]2Cc3ccc(NC(=O)c4cccc(C)c4-c4ccc(cc4)C(F)(F)F)cc3C2)n1
InChI Key: InChIKey=LXROHYSWUUGKNY-DEOSSOPVSA-N
Activity Spreadsheet -- Enzyme Inhibition Constant Data from BindingDB
Found 2 hits for monomerid = 50277330
Trg + Lig
Ki
nM
ΔG°
kcal/mole
IC50
nM
Kd
nM
EC50/IC50
nM
koff
s-1
kon
M-1s-1
pHTemp
°C
Smoothened homolog
(Homo sapiens (Human))
BDBM50277330
((S)-6-methyl-N-(2-((4-methylthiazol-2-yl)methylami...)
Show SMILES Cc1csc(CN[C@H]2Cc3ccc(NC(=O)c4cccc(C)c4-c4ccc(cc4)C(F)(F)F)cc3C2)n1 |r|
Show InChI InChI=1S/C29H26F3N3OS/c1-17-4-3-5-25(27(17)19-6-9-22(10-7-19)29(30,31)32)28(36)35-23-11-8-20-12-24(14-21(20)13-23)33-15-26-34-18(2)16-37-26/h3-11,13,16,24,33H,12,14-15H2,1-2H3,(H,35,36)/t24-/m0/s1
n/an/a 7n/an/an/an/an/an/a
Novartis Institutes for BioMedical Research
Curated by ChEMBL
Assay Description
Antagonist activity at human Smo receptor expressed in CHO cells by [3H]Hh-Ag binding assay
Bioorg Med Chem Lett 19: 328-31 (2008)
Article DOI: 10.1016/j.bmcl.2008.11.096
BindingDB Entry DOI: 10.7270/Q29887ZN
Smoothened homolog
(Mus musculus)
BDBM50277330
((S)-6-methyl-N-(2-((4-methylthiazol-2-yl)methylami...)
Show SMILES Cc1csc(CN[C@H]2Cc3ccc(NC(=O)c4cccc(C)c4-c4ccc(cc4)C(F)(F)F)cc3C2)n1 |r|
Show InChI InChI=1S/C29H26F3N3OS/c1-17-4-3-5-25(27(17)19-6-9-22(10-7-19)29(30,31)32)28(36)35-23-11-8-20-12-24(14-21(20)13-23)33-15-26-34-18(2)16-37-26/h3-11,13,16,24,33H,12,14-15H2,1-2H3,(H,35,36)/t24-/m0/s1
n/an/a 4n/an/an/an/an/an/a
Novartis Institutes for BioMedical Research
Curated by ChEMBL
Assay Description
Antagonist activity at mouse Smo receptor expressed in CHO cells by [3H]Hh-Ag binding assay
Bioorg Med Chem Lett 19: 328-31 (2008)
Article DOI: 10.1016/j.bmcl.2008.11.096
BindingDB Entry DOI: 10.7270/Q29887ZN