BDBM50277509 3-(Cyclohexyloxy)-4'-(2-{[(2R)-2-hydroxy-2-pyridin-3-ylethyl]amino}ethyl)-N-(methylsulfonyl)biphenyl-4-carboxamide Dihydrochloride::CHEMBL445481
SMILES: CS(=O)(=O)NC(=O)c1ccc(cc1OC1CCCCC1)-c1ccc(CCNC[C@H](O)c2cccnc2)cc1
InChI Key: InChIKey=YLQMAAMFQNYJDU-MHZLTWQESA-N
Data: 4 EC50
Activity Spreadsheet -- Enzyme Inhibition Constant Data from BindingDB
Found 4 hits for monomerid = 50277509
Trg + Lig
Ki
nM
ΔG°
kcal/mole
IC50
nM
Kd
nM
EC50/IC50
nM
koff
s-1
kon
M-1s-1
pHTemp
°C
Beta-2 adrenergic receptor
(Homo sapiens (Human))
BDBM50277509
(3-(Cyclohexyloxy)-4'-(2-{[(2R)-2-hydroxy-2-pyridin...)
Show SMILES CS(=O)(=O)NC(=O)c1ccc(cc1OC1CCCCC1)-c1ccc(CCNC[C@H](O)c2cccnc2)cc1 |r|
Show InChI InChI=1S/C29H35N3O5S/c1-38(35,36)32-29(34)26-14-13-23(18-28(26)37-25-7-3-2-4-8-25)22-11-9-21(10-12-22)15-17-31-20-27(33)24-6-5-16-30-19-24/h5-6,9-14,16,18-19,25,27,31,33H,2-4,7-8,15,17,20H2,1H3,(H,32,34)/t27-/m0/s1
Reactome pathway
n/an/an/an/a>1.00E+4n/an/an/an/a
Astellas Pharma Inc.
Curated by ChEMBL
Assay Description
Agonist activity at human recombinant beta2 adrenergic receptor expressed in CHO cells assessed as cAMP accumulation by enzyme immunoassay
J Med Chem 52: 3063-72 (2009)
Article DOI: 10.1021/jm9000709
BindingDB Entry DOI: 10.7270/Q2S75G6J
Beta-3 adrenergic receptor
(Homo sapiens (Human))
BDBM50277509
(3-(Cyclohexyloxy)-4'-(2-{[(2R)-2-hydroxy-2-pyridin...)
Show SMILES CS(=O)(=O)NC(=O)c1ccc(cc1OC1CCCCC1)-c1ccc(CCNC[C@H](O)c2cccnc2)cc1 |r|
Show InChI InChI=1S/C29H35N3O5S/c1-38(35,36)32-29(34)26-14-13-23(18-28(26)37-25-7-3-2-4-8-25)22-11-9-21(10-12-22)15-17-31-20-27(33)24-6-5-16-30-19-24/h5-6,9-14,16,18-19,25,27,31,33H,2-4,7-8,15,17,20H2,1H3,(H,32,34)/t27-/m0/s1
Reactome pathway
n/an/an/an/a 0.130n/an/an/an/a
Astellas Pharma Inc.
Curated by ChEMBL
Assay Description
Agonist activity at human recombinant beta3 adrenergic receptor expressed in CHO cells assessed as cAMP accumulation by enzyme immunoassay
J Med Chem 52: 3063-72 (2009)
Article DOI: 10.1021/jm9000709
BindingDB Entry DOI: 10.7270/Q2S75G6J
Beta-1 adrenergic receptor
(Homo sapiens (Human))
BDBM50277509
(3-(Cyclohexyloxy)-4'-(2-{[(2R)-2-hydroxy-2-pyridin...)
Show SMILES CS(=O)(=O)NC(=O)c1ccc(cc1OC1CCCCC1)-c1ccc(CCNC[C@H](O)c2cccnc2)cc1 |r|
Show InChI InChI=1S/C29H35N3O5S/c1-38(35,36)32-29(34)26-14-13-23(18-28(26)37-25-7-3-2-4-8-25)22-11-9-21(10-12-22)15-17-31-20-27(33)24-6-5-16-30-19-24/h5-6,9-14,16,18-19,25,27,31,33H,2-4,7-8,15,17,20H2,1H3,(H,32,34)/t27-/m0/s1
Reactome pathway
n/an/an/an/a 800n/an/an/an/a
Astellas Pharma Inc.
Curated by ChEMBL
Assay Description
Agonist activity at human recombinant beta-1 adrenergic receptor expressed in CHO cells assessed as cAMP accumulation by enzyme immunoassay
J Med Chem 52: 3063-72 (2009)
Article DOI: 10.1021/jm9000709
BindingDB Entry DOI: 10.7270/Q2S75G6J
Beta-3 adrenergic receptor
(Canis familiaris)
BDBM50277509
(3-(Cyclohexyloxy)-4'-(2-{[(2R)-2-hydroxy-2-pyridin...)
Show SMILES CS(=O)(=O)NC(=O)c1ccc(cc1OC1CCCCC1)-c1ccc(CCNC[C@H](O)c2cccnc2)cc1 |r|
Show InChI InChI=1S/C29H35N3O5S/c1-38(35,36)32-29(34)26-14-13-23(18-28(26)37-25-7-3-2-4-8-25)22-11-9-21(10-12-22)15-17-31-20-27(33)24-6-5-16-30-19-24/h5-6,9-14,16,18-19,25,27,31,33H,2-4,7-8,15,17,20H2,1H3,(H,32,34)/t27-/m0/s1
n/an/an/an/a 1.40n/an/an/an/a
Astellas Pharma Inc.
Curated by ChEMBL
Assay Description
Agonist activity at dog recombinant beta3 adrenergic receptor expressed in CHO cells assessed as cAMP accumulation by enzyme immunoassay
J Med Chem 52: 3063-72 (2009)
Article DOI: 10.1021/jm9000709
BindingDB Entry DOI: 10.7270/Q2S75G6J