BDBM50277717 2-(3-(6-chloro-7-hydroxynaphtho[2,1-d]isoxazol-3-yl)propanamido)cyclohex-1-enecarboxylic acid::CHEMBL483336
SMILES: OC(=O)C1=C(CCCC1)NC(=O)CCc1noc2c1ccc1c(Cl)c(O)ccc21
InChI Key: InChIKey=UNAGMXHROTZMHW-UHFFFAOYSA-N
Data: 2 IC50  1 EC50
Activity Spreadsheet -- Enzyme Inhibition Constant Data from BindingDB
Found 3 hits for monomerid = 50277717
Trg + Lig
Ki
nM
ΔG°
kcal/mole
IC50
nM
Kd
nM
EC50/IC50
nM
koff
s-1
kon
M-1s-1
pHTemp
°C
Cytochrome P450 2C9
(Homo sapiens (Human))
BDBM50277717
(2-(3-(6-chloro-7-hydroxynaphtho[2,1-d]isoxazol-3-y...)
Show SMILES OC(=O)C1=C(CCCC1)NC(=O)CCc1noc2c1ccc1c(Cl)c(O)ccc21 |t:3|
Show InChI InChI=1S/C21H19ClN2O5/c22-19-11-5-6-13-16(24-29-20(13)12(11)7-9-17(19)25)8-10-18(26)23-15-4-2-1-3-14(15)21(27)28/h5-7,9,25H,1-4,8,10H2,(H,23,26)(H,27,28)
Reactome pathway
n/an/a 1.50E+3n/an/an/an/an/an/a
Merck Research Laboratories
Curated by ChEMBL
Assay Description
Inhibition of CYP2C9 in human liver microsomes using diclofenac substrate
J Med Chem 52: 2587-602 (2009)
Article DOI: 10.1021/jm900151e
BindingDB Entry DOI: 10.7270/Q2RJ4JDG
Hydroxycarboxylic acid receptor 2
(Homo sapiens (Human))
BDBM50277717
(2-(3-(6-chloro-7-hydroxynaphtho[2,1-d]isoxazol-3-y...)
Show SMILES OC(=O)C1=C(CCCC1)NC(=O)CCc1noc2c1ccc1c(Cl)c(O)ccc21 |t:3|
Show InChI InChI=1S/C21H19ClN2O5/c22-19-11-5-6-13-16(24-29-20(13)12(11)7-9-17(19)25)8-10-18(26)23-15-4-2-1-3-14(15)21(27)28/h5-7,9,25H,1-4,8,10H2,(H,23,26)(H,27,28)
Reactome pathway
n/an/an/an/a 43n/an/an/an/a
Merck Research Laboratories
Curated by ChEMBL
Assay Description
Agonist activity at human GPR109A expressed in CHOK1 cells by [35S]GTPgammaS binding assay
J Med Chem 52: 2587-602 (2009)
Article DOI: 10.1021/jm900151e
BindingDB Entry DOI: 10.7270/Q2RJ4JDG
Hydroxycarboxylic acid receptor 2
(Homo sapiens (Human))
BDBM50277717
(2-(3-(6-chloro-7-hydroxynaphtho[2,1-d]isoxazol-3-y...)
Show SMILES OC(=O)C1=C(CCCC1)NC(=O)CCc1noc2c1ccc1c(Cl)c(O)ccc21 |t:3|
Show InChI InChI=1S/C21H19ClN2O5/c22-19-11-5-6-13-16(24-29-20(13)12(11)7-9-17(19)25)8-10-18(26)23-15-4-2-1-3-14(15)21(27)28/h5-7,9,25H,1-4,8,10H2,(H,23,26)(H,27,28)
Reactome pathway
n/an/a 1n/an/an/an/an/an/a
Merck Research Laboratories
Curated by ChEMBL
Assay Description
Displacement of [3H]niacin from human GPR109A expressed in CHO cells
J Med Chem 52: 2587-602 (2009)
Article DOI: 10.1021/jm900151e
BindingDB Entry DOI: 10.7270/Q2RJ4JDG