BDBM50277783 2-ethoxy-3-(4-(2-(5-methyl-2-phenyloxazol-4-yl)ethoxy)benzo[b]thiophen-7-yl)propanoic acid::CHEMBL485537
SMILES: CCOC(Cc1ccc(OCCc2nc(oc2C)-c2ccccc2)c2ccsc12)C(O)=O
InChI Key: InChIKey=FPFPBJJEDIYYGK-UHFFFAOYSA-N
Data: 2 IC50  2 EC50
Activity Spreadsheet -- Enzyme Inhibition Constant Data from BindingDB
Found 4 hits for monomerid = 50277783
Trg + Lig
Ki
nM
ΔG°
kcal/mole
IC50
nM
Kd
nM
EC50/IC50
nM
koff
s-1
kon
M-1s-1
pHTemp
°C
Peroxisome proliferator-activated receptor
(Homo sapiens (Human))
BDBM50277783
(2-ethoxy-3-(4-(2-(5-methyl-2-phenyloxazol-4-yl)eth...)
Show SMILES CCOC(Cc1ccc(OCCc2nc(oc2C)-c2ccccc2)c2ccsc12)C(O)=O
Show InChI InChI=1S/C25H25NO5S/c1-3-29-22(25(27)28)15-18-9-10-21(19-12-14-32-23(18)19)30-13-11-20-16(2)31-24(26-20)17-7-5-4-6-8-17/h4-10,12,14,22H,3,11,13,15H2,1-2H3,(H,27,28)
NCI pathway
Reactome pathway
n/an/a 7n/an/an/an/an/an/a
F. Hoffmann-La Roche Ltd
Curated by ChEMBL
Assay Description
Displacement of radio labeled 2(S)-(2-benzoyl-phenylamino)-3-{4-[1,1-ditritio-2-(5-methyl-2-phenyl-oxazol-4-yl)-ethoxy]-phenyl}-propionic acid from G...
Bioorg Med Chem Lett 19: 2468-73 (2009)
Article DOI: 10.1016/j.bmcl.2009.03.036
BindingDB Entry DOI: 10.7270/Q2QC03C3
Peroxisome proliferator-activated receptor
(Homo sapiens (Human))
BDBM50277783
(2-ethoxy-3-(4-(2-(5-methyl-2-phenyloxazol-4-yl)eth...)
Show SMILES CCOC(Cc1ccc(OCCc2nc(oc2C)-c2ccccc2)c2ccsc12)C(O)=O
Show InChI InChI=1S/C25H25NO5S/c1-3-29-22(25(27)28)15-18-9-10-21(19-12-14-32-23(18)19)30-13-11-20-16(2)31-24(26-20)17-7-5-4-6-8-17/h4-10,12,14,22H,3,11,13,15H2,1-2H3,(H,27,28)
NCI pathway
Reactome pathway
n/an/an/an/a 18n/an/an/an/a
F. Hoffmann-La Roche Ltd
Curated by ChEMBL
Assay Description
Agonist activity at human PPARgamma expressed in BHK21 cells assessed as SEAP activity by luciferase reporter transactivation assay
Bioorg Med Chem Lett 19: 2468-73 (2009)
Article DOI: 10.1016/j.bmcl.2009.03.036
BindingDB Entry DOI: 10.7270/Q2QC03C3
Peroxisome proliferator-activated receptor alpha (PPAR alpha)
(Homo sapiens (Human))
BDBM50277783
(2-ethoxy-3-(4-(2-(5-methyl-2-phenyloxazol-4-yl)eth...)
Show SMILES CCOC(Cc1ccc(OCCc2nc(oc2C)-c2ccccc2)c2ccsc12)C(O)=O
Show InChI InChI=1S/C25H25NO5S/c1-3-29-22(25(27)28)15-18-9-10-21(19-12-14-32-23(18)19)30-13-11-20-16(2)31-24(26-20)17-7-5-4-6-8-17/h4-10,12,14,22H,3,11,13,15H2,1-2H3,(H,27,28)
n/an/an/an/a 27n/an/an/an/a
F. Hoffmann-La Roche Ltd
Curated by ChEMBL
Assay Description
Agonist activity at human PPARalpha by luciferase reporter transactivation assay
Bioorg Med Chem Lett 19: 2468-73 (2009)
Article DOI: 10.1016/j.bmcl.2009.03.036
BindingDB Entry DOI: 10.7270/Q2QC03C3
Peroxisome proliferator-activated receptor alpha (PPAR alpha)
(Homo sapiens (Human))
BDBM50277783
(2-ethoxy-3-(4-(2-(5-methyl-2-phenyloxazol-4-yl)eth...)
Show SMILES CCOC(Cc1ccc(OCCc2nc(oc2C)-c2ccccc2)c2ccsc12)C(O)=O
Show InChI InChI=1S/C25H25NO5S/c1-3-29-22(25(27)28)15-18-9-10-21(19-12-14-32-23(18)19)30-13-11-20-16(2)31-24(26-20)17-7-5-4-6-8-17/h4-10,12,14,22H,3,11,13,15H2,1-2H3,(H,27,28)
n/an/a 22n/an/an/an/an/an/a
F. Hoffmann-La Roche Ltd
Curated by ChEMBL
Assay Description
Displacement of radio labeled 2(S)-(2-benzoyl-phenylamino)-3-{4-[1,1-ditritio-2-(5-methyl-2-phenyl-oxazol-4-yl)-ethoxy]-phenyl}-propionic acid from G...
Bioorg Med Chem Lett 19: 2468-73 (2009)
Article DOI: 10.1016/j.bmcl.2009.03.036
BindingDB Entry DOI: 10.7270/Q2QC03C3