null
SMILES: CC[C@H](C)CN1[C@H]([C@H](C(O)=O)c2ccccc2C1=O)c1ccc(Cl)c(Cl)c1
InChI Key: InChIKey=FCUZYJPQVKCVEM-RQUSPXKASA-N
Activity Spreadsheet -- Enzyme Inhibition Constant Data from BindingDB
Found 1 hit for monomerid = 50277852
Trg + Lig
Ki
nM
ΔG°
kcal/mole
IC50
nM
Kd
nM
EC50/IC50
nM
koff
s-1
kon
M-1s-1
pHTemp
°C
Free fatty acid receptor 1
(Homo sapiens (Human))
BDBM50277852
((3R,4R)-3-(3,4-dichlorophenyl)-2-((S)-2-methylbuty...)
Show SMILES CC[C@H](C)CN1[C@H]([C@H](C(O)=O)c2ccccc2C1=O)c1ccc(Cl)c(Cl)c1 |r|
Show InChI InChI=1S/C21H21Cl2NO3/c1-3-12(2)11-24-19(13-8-9-16(22)17(23)10-13)18(21(26)27)14-6-4-5-7-15(14)20(24)25/h4-10,12,18-19H,3,11H2,1-2H3,(H,26,27)/t12-,18+,19-/m0/s1
n/an/a 13n/an/an/an/an/an/a
Pfizer Global R&D
Curated by ChEMBL
Assay Description
Antagonist activity at human GPR40 expressed HEK293 cells assessed as effect on intracellular calcium concentration by FLIPR assay
Bioorg Med Chem Lett 19: 2400-3 (2009)
Article DOI: 10.1016/j.bmcl.2009.03.082
BindingDB Entry DOI: 10.7270/Q23N238P