null
SMILES: CC[C@H](C)CN1[C@H]([C@H](C(O)=O)c2ccccc2C1=O)c1cc2ccccc2o1
InChI Key: InChIKey=PVDAZALKKARTGW-DLPLYFIVSA-N
Activity Spreadsheet -- Enzyme Inhibition Constant Data from BindingDB
Found 1 hit for monomerid = 50277888
Trg + Lig
Ki
nM
ΔG°
kcal/mole
IC50
nM
Kd
nM
EC50/IC50
nM
koff
s-1
kon
M-1s-1
pHTemp
°C
Free fatty acid receptor 1
(Homo sapiens (Human))
BDBM50277888
((3R,4R)-3-(benzofuran-2-yl)-2-((S)-2-methylbutyl)-...)
Show SMILES CC[C@H](C)CN1[C@H]([C@H](C(O)=O)c2ccccc2C1=O)c1cc2ccccc2o1 |r|
Show InChI InChI=1S/C23H23NO4/c1-3-14(2)13-24-21(19-12-15-8-4-7-11-18(15)28-19)20(23(26)27)16-9-5-6-10-17(16)22(24)25/h4-12,14,20-21H,3,13H2,1-2H3,(H,26,27)/t14-,20+,21-/m0/s1
n/an/a 20n/an/an/an/an/an/a
Pfizer Global R&D
Curated by ChEMBL
Assay Description
Antagonist activity at human GPR40 expressed HEK293 cells assessed as effect on intracellular calcium concentration by FLIPR assay
Bioorg Med Chem Lett 19: 2400-3 (2009)
Article DOI: 10.1016/j.bmcl.2009.03.082
BindingDB Entry DOI: 10.7270/Q23N238P