BDBM50278374 CHEMBL471453::methyl 4-(2-amino-5-(thiophen-2-yl)phenylcarbamoyl)benzyl(phenyl)phosphinate
SMILES: COP(=O)(Cc1ccc(cc1)C(=O)Nc1cc(ccc1N)-c1cccs1)c1ccccc1
InChI Key: InChIKey=MLQPEVICWDREHG-UHFFFAOYSA-N
Data: 1 IC50
Activity Spreadsheet -- Enzyme Inhibition Constant Data from BindingDB
Found 1 hit for monomerid = 50278374
Trg + Lig
Ki
nM
ΔG°
kcal/mole
IC50
nM
Kd
nM
EC50/IC50
nM
koff
s-1
kon
M-1s-1
pHTemp
°C
Histone deacetylase 1
(Homo sapiens (Human))
BDBM50278374
(CHEMBL471453 | methyl 4-(2-amino-5-(thiophen-2-yl)...)
Show SMILES COP(=O)(Cc1ccc(cc1)C(=O)Nc1cc(ccc1N)-c1cccs1)c1ccccc1
Show InChI InChI=1S/C25H23N2O3PS/c1-30-31(29,21-6-3-2-4-7-21)17-18-9-11-19(12-10-18)25(28)27-23-16-20(13-14-22(23)26)24-8-5-15-32-24/h2-16H,17,26H2,1H3,(H,27,28)
NCI pathway
Reactome pathway
n/an/a 20n/an/an/an/an/an/a
Merck Research Laboratories
Curated by ChEMBL
Assay Description
Inhibition of HDAC1
Bioorg Med Chem Lett 19: 2053-8 (2009)
Article DOI: 10.1016/j.bmcl.2009.02.009
BindingDB Entry DOI: 10.7270/Q2QV3MDQ