null
SMILES: NCC(NC(=O)c1cc(cs1)-c1c[nH]c2ncccc12)c1ccccc1
InChI Key: InChIKey=ZNBOMXQVNVLXCZ-UHFFFAOYSA-N
PDB links: 1 PDB ID matches this monomer.
Activity Spreadsheet -- Enzyme Inhibition Constant Data from BindingDB
Found 1 hit for monomerid = 50278565
Trg + Lig
Ki
nM
ΔG°
kcal/mole
IC50
nM
Kd
nM
EC50/IC50
nM
koff
s-1
kon
M-1s-1
pHTemp
°C
RAC-alpha serine/threonine-protein kinase
(Homo sapiens (Human))
BDBM50278565
(CHEMBL512305 | N-(2-amino-1-phenylethyl)-4-(1H-pyr...)
Show SMILES NCC(NC(=O)c1cc(cs1)-c1c[nH]c2ncccc12)c1ccccc1
Show InChI InChI=1S/C20H18N4OS/c21-10-17(13-5-2-1-3-6-13)24-20(25)18-9-14(12-26-18)16-11-23-19-15(16)7-4-8-22-19/h1-9,11-12,17H,10,21H2,(H,22,23)(H,24,25)
n/an/a 25n/an/an/an/an/an/a
GlaxoSmithKline
Curated by ChEMBL
Assay Description
Inhibition of AKT1
Bioorg Med Chem Lett 19: 2244-8 (2009)
Article DOI: 10.1016/j.bmcl.2009.02.094
BindingDB Entry DOI: 10.7270/Q24X57PX